{"text_format":"1","workbook":"xlsx","n_sheets":12,"sheets":["Bilgi-27","F1form","F1form-y","NorGiris","NorForm","NorForm-y","IOGIRIS","IOFORM","SINAV","SINAVFORM","F1formp","Ekders formu-Y"],"not_rendered":{"charts":0,"images":11,"macros":1,"external_links":0,"defined_names":11,"comments":0,"pivot_tables":0},"unopened":[],"bounds":{"document_bytes":16777216,"sheet_cells":100000,"rows_first":2000,"rows_last":500,"rows_between":2000,"halvings":0,"cell_chars":16384,"cell_head_chars":4096},"cells_cut":0,"cells_raw":0,"read":"whole","date_system":"1900"}

{"sheet":"Bilgi-27","index":0,"n_rows":500,"n_cols":76,"rows_kept":500,"cut":false,"hidden":false,"merged":[[7,49,7,52],[7,53,7,63],[6,6,6,24],[6,25,6,46],[17,70,17,75],[18,70,18,75],[32,70,32,75],[47,65,47,66],[33,70,33,75],[10,6,10,24],[40,38,40,42],[40,33,40,37],[19,23,19,27],[21,23,21,27],[33,23,33,27],[40,23,40,27],[37,23,37,27],[21,28,21,32],[21,33,21,37],[21,38,21,42],[19,38,19,42],[24,28,24,32],[28,33,28,37],[28,38,28,42],[59,15,59,19],[59,20,59,24],[59,25,59,29],[59,30,59,34],[59,35,59,39],[59,40,59,44],[59,45,59,49],[59,50,59,54],[57,15,57,19],[57,20,57,24],[57,25,57,29],[57,30,57,34],[57,35,57,39],[57,40,57,44],[57,45,57,49],[57,50,57,54],[58,15,58,19],[58,20,58,24],[58,25,58,29],[58,30,58,34],[58,35,58,39],[58,40,58,44],[58,45,58,49],[58,50,58,54],[56,45,56,49],[56,50,56,54],[55,45,55,49],[55,50,55,54],[55,9,55,14],[56,9,56,14],[54,9,54,14],[55,15,55,19],[55,20,55,24],[55,25,55,29],[55,30,55,34],[55,35,55,39],[55,40,55,44],[56,15,56,19],[56,20,56,24],[56,25,56,29],[56,30,56,34],[56,35,56,39],[56,40,56,44],[54,15,54,19],[54,20,54,24],[50,10,50,53],[43,23,43,27],[43,28,43,32],[43,33,43,37],[42,18,42,22],[41,28,41,32],[54,25,54,29],[54,30,54,34],[54,35,54,39],[41,33,41,37],[41,38,41,42],[42,38,42,42],[43,48,43,52],[42,53,42,57],[43,53,43,57],[42,33,42,37],[54,40,54,44],[54,45,54,49],[54,50,54,54],[42,13,42,17],[48,28,48,48],[49,28,49,48],[48,50,48,70],[49,50,49,70],[20,1,21,4],[20,5,20,7],[20,8,20,12],[20,13,20,17],[20,18,20,22],[48,2,48,6],[48,8,48,16],[21,5,21,7],[21,18,21,22],[29,5,29,7],[33,13,33,17],[33,18,33,22],[38,1,39,4],[38,5,38,7],[40,18,40,22],[37,8,37,12],[34,1,35,4],[34,5,34,7],[35,5,35,7],[43,18,43,22],[22,1,23,4],[22,5,22,7],[23,5,23,7],[24,1,25,4],[28,28,28,32],[19,33,19,37],[39,48,39,52],[40,48,40,52],[41,48,41,52],[42,48,42,52],[42,58,42,62],[43,58,43,62],[19,43,19,47],[41,43,41,47],[23,33,23,37],[23,38,23,42],[23,43,23,47],[21,43,21,47],[23,48,23,52],[24,48,24,52],[27,48,27,52],[28,43,28,47],[28,48,28,52],[26,48,26,52],[25,48,25,52],[27,28,27,32],[33,48,33,52],[29,43,29,47],[19,8,19,12],[19,13,19,17],[19,18,19,22],[22,48,22,52],[21,48,21,52],[24,33,24,37],[24,38,24,42],[22,23,22,27],[22,28,22,32],[22,33,22,37],[20,23,20,27],[20,28,20,32],[21,8,21,12],[21,13,21,17],[22,43,22,47],[22,8,22,12],[22,13,22,17],[22,18,22,22],[23,8,23,12],[23,13,23,17],[22,38,22,42],[23,18,23,22],[23,23,23,27],[23,28,23,32],[11,25,11,46],[12,6,12,24],[12,25,12,46],[18,1,18,47],[17,8,17,20],[17,22,17,28],[14,6,14,12],[15,6,15,12],[14,13,14,17],[14,19,14,23],[0,1,0,52],[2,6,2,24],[2,25,2,46],[3,6,3,24],[3,25,3,46],[5,6,5,24],[5,25,5,46],[20,33,20,37],[20,38,20,42],[20,43,20,47],[20,48,20,52],[18,48,19,52],[19,1,19,7],[15,13,15,17],[7,25,7,46],[8,6,8,24],[8,25,8,46],[9,6,9,24],[9,25,9,46],[7,6,7,24],[17,1,17,7],[19,28,19,32],[10,25,10,46],[11,6,11,24],[24,5,24,7],[24,8,24,12],[24,13,24,17],[24,18,24,22],[24,23,24,27],[27,33,27,37],[27,38,27,42],[27,43,27,47],[24,43,24,47],[25,5,25,7],[25,8,25,12],[25,13,25,17],[25,18,25,22],[25,23,25,27],[26,23,26,27],[26,28,26,32],[25,28,25,32],[25,33,25,37],[25,38,25,42],[25,43,25,47],[26,33,26,37],[26,38,26,42],[26,43,26,47],[27,23,27,27],[26,1,27,4],[26,5,26,7],[26,8,26,12],[26,13,26,17],[26,18,26,22],[27,5,27,7],[27,8,27,12],[27,13,27,17],[27,18,27,22],[29,48,29,52],[31,8,31,20],[31,22,31,28],[34,28,34,32],[34,33,34,37],[34,38,34,42],[34,43,34,47],[34,58,34,62],[33,33,33,37],[33,38,33,42],[33,43,33,47],[34,48,34,52],[29,28,29,32],[35,58,35,62],[35,48,35,52],[33,1,33,7],[29,33,29,37],[33,8,33,12],[33,28,33,32],[33,53,33,57],[29,23,29,27],[29,8,29,12],[29,13,29,17],[29,18,29,22],[34,8,34,12],[35,8,35,12],[28,1,29,4],[28,5,28,7],[28,8,28,12],[28,13,28,17],[28,18,28,22],[28,23,28,27],[32,58,33,62],[35,38,35,42],[35,28,35,32],[31,1,31,7],[29,38,29,42],[36,38,36,42],[35,33,35,37],[35,43,35,47],[34,53,34,57],[35,18,35,22],[35,23,35,27],[36,48,36,52],[35,13,35,17],[34,18,34,22],[34,23,34,27],[34,13,34,17],[36,13,36,17],[38,33,38,37],[38,28,38,32],[37,28,37,32],[40,1,41,4],[40,5,40,7],[40,8,40,12],[36,1,37,4],[36,5,36,7],[36,8,36,12],[38,13,38,17],[38,18,38,22],[36,33,36,37],[37,18,37,22],[41,13,41,17],[41,18,41,22],[36,18,36,22],[39,8,39,12],[39,13,39,17],[39,18,39,22],[39,23,39,27],[40,13,40,17],[37,13,37,17],[39,33,39,37],[39,28,39,32],[27,54,27,55],[27,56,27,57],[32,1,32,57],[40,43,40,47],[43,38,43,42],[43,43,43,47],[36,53,36,57],[42,1,43,4],[42,5,42,7],[42,8,42,12],[43,5,43,7],[40,53,40,57],[41,53,41,57],[38,43,38,47],[37,43,37,47],[37,5,37,7],[41,5,41,7],[41,8,41,12],[43,8,43,12],[43,13,43,17],[39,38,39,42],[39,5,39,7],[38,8,38,12],[37,33,37,37],[39,58,39,62],[36,58,36,62],[42,23,42,27],[42,28,42,32],[42,43,42,47],[39,43,39,47],[35,53,35,57],[39,53,39,57],[37,58,37,62],[37,53,37,57],[38,53,38,57],[37,48,37,52],[41,23,41,27],[36,23,36,27],[36,28,36,32],[40,58,40,62],[41,58,41,62],[38,58,38,62],[38,48,38,52],[38,38,38,42],[37,38,37,42],[36,43,36,47],[38,23,38,27],[40,28,40,32]]}
[null,"TEMEL BİLGİ PARAMETRELERİ"]
[]
[null,null,null,null,null,null,"Egitim Ögretim Yılı",null,null,null,null,null,null,null,null,null,null,null,null,null,null,null,null,null,null,"2025-2026"]
[null,null,null,null,null,null,"Egitim Ögretim Dönemi",null,null,null,null,null,null,null,null,null,null,null,null,null,null,null,null,null,null,"GÜZ"]
[null,null,null,null,null,null,null,null,null,null,null,null,null,null,null,null,null,null,null,null,null,null,null,null,null,null,null,null,null,null,null,null,null,null,null,null,null,null,null,null,null,null,null,null,null,null,null,null,null,null,null,null,null,null,null,"Öğr.Gör.Celalettin AYDIN"]
[null,null,null,null,null,null,"Kurum Adi",null,null,null,null,null,null,null,null,null,null,null,null,null,null,null,null,null,null,"Ç.Ü. CEyhan Meslek Yüksekokulu"]
[null,null,null,null,null,null,"Ünvan",null,null,null,null,null,null,null,null,null,null,null,null,null,null,null,null,null,null,"Öğr.Gör."]
[null,null,null,null,null,null,"Ögretim Elamanının  Ünvanı, Adi - Soyadı",null,null,null,null,null,null,null,null,null,null,null,null,null,null,null,null,null,null,"Celalettin AYDIN"]
[null,null,null,null,null,null,"Ögretim Elamanının  İdari Görevi"]
[null,null,null,null,null,null,"Ögretim Elamanının  Çalıştığı Bölüm Adi",null,null,null,null,null,null,null,null,null,null,null,null,null,null,null,null,null,null,"Bilgisayar Bölümü"]
[null,null,null,null,null,null,"Onay  Veren Makam",null,null,null,null,null,null,null,null,null,null,null,null,null,null,null,null,null,null,"Müdür"]
[null,null,null,null,null,null,"Kurum Yetkilisinin    Ünvanı, Adı - Soyadı",null,null,null,null,null,null,null,null,null,null,null,null,null,null,null,null,null,null,"Prof. Dr. Mutlu AVCI"]
[null,null,null,null,null,null,"Bölüm Yetkilisinin    Ünvanı, Adı - Soyadı",null,null,null,null,null,null,null,null,null,null,null,null,null,null,null,null,null,null,"Ögr. Gör. Celalettin AYDIN",null,null,null,null,null,null,null,null,null,null,null,null,null,null,null,null,null,null,null,null,null,null,null,null,null,null,null,null,null,null,null,null,null,null,null,null,null,null," "]
[]
[null,null,null,null,null,null,"DÖNEM TARİH",null,null,null,null,null,null,"2025-09-27",null,null,null,null,"-",{"$f":"IF($N$16=1,$N$15+4,IF($N$16=2,$N$15+11,IF($N$16=3,$N$15+18,IF($N$16=4,$N$15+25,IF($N$16=5,$N$15+32,0)))))","v":"2025-10-01"}]
[null,null,null,null,null,null,"HAFTA SAYISI",null,null,null,null,null,null,1]
[]
[null,null,null,null,null,null,null,null,null,null,null,null,null,null,null,null,null,null,null,null,null,null,"Normal Öğretim",null,null,null,null,null,null,null,null,null,null,null,null,null,null,null,null,null,null,null,null,null,null,null,null,null,null,null,null,null,null,null,null,null,null,null,null,null,null,null,null,null,null,null,null,null,null,null,"Verdiği Ders"]
[null,"Haftalık Ders Programı",null,null,null,null,null,null,null,null,null,null,null,null,null,null,null,null,null,null,null,null,null,null,null,null,null,null,null,null,null,null,null,null,null,null,null,null,null,null,null,null,null,null,null,null,null,null,"TOPLAM",null,null,null,null,null,null,null,null,null,null,null,null,null,null,null,null,null,null,null,null,null,"Listesi (Normal)"]
[null,"Günler",null,null,null,null,null,null,{"$f":"P56","v":"08:30-09:15"},null,null,null,null,{"$f":"U56","v":"09:30-10:15"},null,null,null,null,{"$f":"Z56","v":"10:30-11:15"},null,null,null,null,{"$f":"AE56","v":"11:30-12:15"},null,null,null,null,{"$f":"AJ56","v":"13:00-13:45"},null,null,null,null,{"$f":"AO56","v":"14:00-14:45"},null,null,null,null,{"$f":"AT56","v":"15:00-15:45"},null,null,null,null,{"$f":"AY56","v":"16:00-16:45"},null,null,null,null,null,null,null,null,null,null,null,null,null,null,null,null,null,null,null,null,null,null,null,null,null,null,"Dersin Kodu","Dersin Adi","T","U","TP","Eksik"]
[null,"Pazartesi",null,null,null,"Teorik",null,null,null,null,null,null,null,null,null,null,null,null,null,null,null,null,null,null,null,null,null,null,null,null,null,null,null,null,null,null,null,null,null,null,null,null,null,null,null,null,null,null,{"$f":"40-COUNTBLANK(I21:AV21)","v":0},null,null,null,null,null,null,null,null,null,null,null,null,null,null,null,null,null,null,null,null,{"$f":"IF(BS21<>\"\",1,\"\")","v":1},{"$f":"IF(F1form!C15<>\"\",IF(F1form!C15<>0,F1form!C15,\"\"),\"\")","v":"BLP 157"},{"$f":"IF(F1form!D15<>\"\",IF(F1form!D15<>0,F1form!D15,\"\"),\"\")","v":"Web Tasarımının Temelleri"},{"$f":"IF(F1form!D15<>\"\",IF(F1form!D15<>0,F1form!H15,\"\"),\"\")","v":2},{"$f":"IF(F1form!D15<>\"\",IF(F1form!D15<>0,F1form!I15,\"\"),\"\")","v":0},{"$f":"IF(AND(BU21=\"\",BV21=\"\")=TRUE,\"\",BU21+BV21)","v":2},{"$f":"IF(BS21<>\"\",BW21-COUNTIF($I$21:$AV$30,BS21),\"\")","v":0}]
[null,null,null,null,null,"Diğer f.",null,null,null,null,null,null,null,null,null,null,null,null,null,null,null,null,null,null,null,null,null,null,null,null,null,null,null,null,null,null,null,null,null,null,null,null,null,null,null,null,null,null,{"$f":"40-COUNTBLANK(I22:AV22)","v":0},null,null,null,null,null,null,null,null,null,null,null,null,null,null,null,null,null,null,null,null,{"$f":"IF(BS22<>\"\",IF(BS22<>0,BR21+1,\"\"),\"\")","v":2},{"$f":"IF(F1form!C16<>\"\",IF(F1form!C16<>0,F1form!C16,\"\"),\"\")","v":"BLP 215"},{"$f":"IF(F1form!D16<>\"\",IF(F1form!D16<>0,F1form!D16,\"\"),\"\")","v":"Sensörler"},{"$f":"IF(F1form!D16<>\"\",IF(F1form!D16<>0,F1form!H16,\"\"),\"\")","v":2},{"$f":"IF(F1form!D16<>\"\",IF(F1form!D16<>0,F1form!I16,\"\"),\"\")","v":0},2,{"$f":"IF(BS22<>\"\",BW22-COUNTIF($I$21:$AV$30,BS22),\"\")","v":0}]
[null,"Salı",null,null,null,"Teorik",null,null,null,null,null,null,null,null,null,null,null,null,null,null,null,null,null,null,null,null,null,null,null,null,null,null,null,null,null,null,null,null,null,null,null,null,null,null,null,null,null,null,0,null,null,null,null,null,null,null,null,null,null,null,null,null,null,null,null,null,null,null,null,"",{"$f":"IF(F1form!C17<>\"\",IF(F1form!C17<>0,F1form!C17,\"\"),\"\")","v":""},{"$f":"IF(F1form!D17<>\"\",IF(F1form!D17<>0,F1form!D17,\"\"),\"\")","v":""},{"$f":"IF(F1form!D17<>\"\",IF(F1form!D17<>0,F1form!H17,\"\"),\"\")","v":""},{"$f":"IF(F1form!D17<>\"\",IF(F1form!D17<>0,F1form!I17,\"\"),\"\")","v":""},"",{"$f":"IF(BS23<>\"\",BW23-COUNTIF($I$21:$AV$30,BS23),\"\")","v":""}]
[null,null,null,null,null,"Diğer f.",null,null,null,null,null,null,null,null,null,null,null,null,null,null,null,null,null,null,null,null,null,null,null,null,null,null,null,null,null,null,null,null,null,null,null,null,null,null,null,null,null,null,0,null,null,null,null,null,null,null,null,null,null,null,null,null,null,null,null,null,null,null,null,"",{"$f":"IF(F1form!C18<>\"\",IF(F1form!C18<>0,F1form!C18,\"\"),\"\")","v":""},{"$f":"IF(F1form!D18<>\"\",IF(F1form!D18<>0,F1form!D18,\"\"),\"\")","v":""},{"$f":"IF(F1form!D18<>\"\",IF(F1form!D18<>0,F1form!H18,\"\"),\"\")","v":""},{"$f":"IF(F1form!D18<>\"\",IF(F1form!D18<>0,F1form!I18,\"\"),\"\")","v":""},"",""]
[null,"Çarşamba",null,null,null,"Teorik",null,null,null,null,null,null,null,null,null,null,null,null,null,null,null,null,null,null,null,null,null,null,null,null,null,null,null,null,null,null,null,null,null,null,null,null,null,null,null,null,null,null,0,null,null,null,null,null,null,null,null,null,null,null,null,null,null,null,null,null,null,null,null,"",{"$f":"IF(F1form!C19<>\"\",IF(F1form!C19<>0,F1form!C19,\"\"),\"\")","v":""},{"$f":"IF(F1form!D19<>\"\",IF(F1form!D19<>0,F1form!D19,\"\"),\"\")","v":""},{"$f":"IF(F1form!D19<>\"\",IF(F1form!D19<>0,F1form!H19,\"\"),\"\")","v":""},{"$f":"IF(F1form!D19<>\"\",IF(F1form!D19<>0,F1form!I19,\"\"),\"\")","v":""},"",""]
[null,null,null,null,null,"Diğer f.",null,null,null,null,null,null,null,null,null,null,null,null,null,null,null,null,null,null,null,null,null,null,null,null,null,null,null,null,null,null,null,null,null,null,null,null,null,null,null,null,null,null,0,null,null,null,null,null,null,null,null,null,null,null,null,null,null,null,null,null,null,null,null,{"$f":"IF(BS26<>\"\",IF(BS26<>0,BR25+1,\"\"),\"\")","v":""},{"$f":"IF(F1form!C20<>\"\",IF(F1form!C20<>0,F1form!C20,\"\"),\"\")","v":""},{"$f":"IF(F1form!D20<>\"\",IF(F1form!D20<>0,F1form!D20,\"\"),\"\")","v":""},{"$f":"IF(F1form!D20<>\"\",IF(F1form!D20<>0,F1form!H20,\"\"),\"\")","v":""},{"$f":"IF(F1form!D20<>\"\",IF(F1form!D20<>0,F1form!I20,\"\"),\"\")","v":""},{"$f":"IF(AND(BU26=\"\",BV26=\"\")=TRUE,\"\",BU26+BV26)","v":""},""]
[null,"Perşembe",null,null,null,"Teorik",null,null,null,null,null,null,null,null,null,null,null,null,null,null,null,null,null,null,null,null,null,null,null,null,null,null,null,null,null,null,null,null,null,null,null,null,null,null,null,null,null,null,0,null,null,null,null,null,null,null,null,null,null,null,null,null,null,null,null,null,null,null,null,"",{"$f":"IF(F1form!C21<>\"\",IF(F1form!C21<>0,F1form!C21,\"\"),\"\")","v":""},{"$f":"IF(F1form!D21<>\"\",IF(F1form!D21<>0,F1form!D21,\"\"),\"\")","v":""},{"$f":"IF(F1form!D21<>\"\",IF(F1form!D21<>0,F1form!H21,\"\"),\"\")","v":""},{"$f":"IF(F1form!D21<>\"\",IF(F1form!D21<>0,F1form!I21,\"\"),\"\")","v":""},"",""]
[null,null,null,null,null,"Diğer f.",null,null,null,null,null,null,null,null,null,null,null,null,null,null,null,null,null,null,null,null,null,null,null,null,null,null,null,null,null,null,null,null,null,null,null,null,null,null,null,null,null,null,0,null,null,null,null,null,"Teorik",null,"Uyg.",null,null,null,null,null,null,null,null,null,null,null,null,"",{"$f":"IF(F1form!C22<>\"\",IF(F1form!C22<>0,F1form!C22,\"\"),\"\")","v":""},{"$f":"IF(F1form!D22<>\"\",IF(F1form!D22<>0,F1form!D22,\"\"),\"\")","v":""},{"$f":"IF(F1form!D22<>\"\",IF(F1form!D22<>0,F1form!H22,\"\"),\"\")","v":""},{"$f":"IF(F1form!D22<>\"\",IF(F1form!D22<>0,F1form!I22,\"\"),\"\")","v":""},"",""]
[null,"Cuma",null,null,null,"Teorik",null,null,null,null,null,null,null,null,null,null,null,null,"BLP 157",null,null,null,null,"BLP 157",null,null,null,null,"BLP 215",null,null,null,null,"BLP 215",null,null,null,null,null,null,null,null,null,null,null,null,null,null,4,null,null,null,null,null,null,{"$f":"SUM(AW21,AW23,AW25,AW27,AW29)","v":4},null,{"$f":"SUM(AW22,AW24,AW26,AW28,AW30)","v":0},null,null,null,null,null,null,null,null,null,null,null,"",{"$f":"IF(F1form!C23<>\"\",IF(F1form!C23<>0,F1form!C23,\"\"),\"\")","v":""},{"$f":"IF(F1form!D23<>\"\",IF(F1form!D23<>0,F1form!D23,\"\"),\"\")","v":""},{"$f":"IF(F1form!D23<>\"\",IF(F1form!D23<>0,F1form!H23,\"\"),\"\")","v":""},{"$f":"IF(F1form!D23<>\"\",IF(F1form!D23<>0,F1form!I23,\"\"),\"\")","v":""},"",""]
[null,null,null,null,null,"Diğer f.",null,null,null,null,null,null,null,null,null,null,null,null,null,null,null,null,null,null,null,null,null,null,null,null,null,null,null,null,null,null,null,null,null,null,null,null,null,null,null,null,null,null,0,null,null,null,null,null,null,null,null,{"$f":"SUM(BD29:BF29)","v":4},null,{"$f":"NorGiris!BC20","v":""},null,null,null,null,null,null,null,null,null,"",{"$f":"IF(F1form!C24<>\"\",IF(F1form!C24<>0,F1form!C24,\"\"),\"\")","v":""},{"$f":"IF(F1form!D24<>\"\",IF(F1form!D24<>0,F1form!D24,\"\"),\"\")","v":""},{"$f":"IF(F1form!D24<>\"\",IF(F1form!D24<>0,F1form!H24,\"\"),\"\")","v":""},{"$f":"IF(F1form!D24<>\"\",IF(F1form!D24<>0,F1form!I24,\"\"),\"\")","v":""},"",""]
[null,null,null,null,null,null,null,null,null,null,null,null,null,null,null,null,null,null,null,null,null,null,null,null,null,null,null,null,null,null,null,null,null,null,null,null,null,null,null,null,null,null,null,null,null,null,null,null,null,null,null,null,null,null,null,null,null,null,null,null,null,null,null,null,null,null,null,null,null,null,null,null,{"$f":"SUM(BU21:BU30)","v":4},{"$f":"SUM(BV21:BV30)","v":0},4,0]
[null,null,null,null,null,null,null,null,null,null,null,null,null,null,null,null,null,null,null,null,null,null,"İkinci Öğretim"]
[null,"Haftalık Ders Programı",null,null,null,null,null,null,null,null,null,null,null,null,null,null,null,null,null,null,null,null,null,null,null,null,null,null,null,null,null,null,null,null,null,null,null,null,null,null,null,null,null,null,null,null,null,null,null,null,null,null,null,null,null,null,null,null,"TOPLAM",null,null,null,null,null,null,null,null,null,null,null,"Verdiği Ders"]
[null,"Günler",null,null,null,null,null,null,"13:00-13:45",null,null,null,null,"14:00-14:45",null,null,null,null,{"$f":"P57","v":"15:00-14:45"},null,null,null,null,{"$f":"U57","v":"16:00-16:45"},null,null,null,null,{"$f":"Z57","v":"17:00-17:45"},null,null,null,null,{"$f":"AE57","v":"18:00-1845"},null,null,null,null,{"$f":"AJ57","v":"19:00-19:45"},null,null,null,null,{"$f":"AO57","v":"20:00-20:45"},null,null,null,null,{"$f":"AT57","v":"21:00-21:45"},null,null,null,null,{"$f":"AY57","v":"22:00-22:45"},null,null,null,null,null,null,null,null,null,null,null,null,null,null,null,null,"Listesi (İkinci)"]
[null,"Pazartesi",null,null,null,"Teorik",null,null,null,null,null,null,null,null,null,null,null,null,null,null,null,null,null,null,null,null,null,null,null,null,null,null,null,null,null,null,null,null,null,null,null,null,null,null,null,null,null,null,null,null,null,null,null,null,null,null,null,null,{"$f":"50-COUNTBLANK(I35:BF35)","v":0},null,null,null,null,null,null,null,null,null,null,null,"Dersin Kodu","Dersin Adi","T","U","TP","Eksik"]
[null,null,null,null,null,"Diğer f.",null,null,null,null,null,null,null,null,null,null,null,null,null,null,null,null,null,null,null,null,null,null,null,null,null,null,null,null,null,null,null,null,null,null,null,null,null,null,null,null,null,null,null,null,null,null,null,null,null,null,null,null,{"$f":"50-COUNTBLANK(I36:BF36)","v":0},null,null,null,null,null,null,null,null,null,null,{"$f":"IF(BS36<>\"\",1,\"\")","v":""},{"$f":"IF(F1form!C31<>\"\",IF(F1form!C31<>0,F1form!C31,\"\"),\"\")","v":""},{"$f":"IF(F1form!D31<>\"\",IF(F1form!D31<>0,F1form!D31,\"\"),\"\")","v":""},{"$f":"IF(F1form!D31<>\"\",IF(F1form!D31<>0,F1form!H31,\"\"),\"\")","v":""},{"$f":"IF(F1form!D31<>\"\",IF(F1form!D31<>0,F1form!I31,\"\"),\"\")","v":""},{"$f":"IF(AND(BU36=\"\",BV36=\"\")=TRUE,\"\",BU36+BV36)","v":""},{"$f":"IF(BS36<>\"\",BW36-COUNTIF($I$35:$BF$44,BS36),\"\")","v":""}]
[null,"Salı",null,null,null,"Teorik",null,null,null,null,null,null,null,null,null,null,null,null,null,null,null,null,null,null,null,null,null,null,null,null,null,null,null,null,null,null,null,null,null,null,null,null,null,null,null,null,null,null,null,null,null,null,null,null,null,null,null,null,0,null,null,null,null,null,null,null,null,null,null,{"$f":"IF(BS37<>\"\",IF(BS37<>0,BR36+1,\"\"),\"\")","v":""},{"$f":"IF(F1form!C32<>\"\",IF(F1form!C32<>0,F1form!C32,\"\"),\"\")","v":""},{"$f":"IF(F1form!D32<>\"\",IF(F1form!D32<>0,F1form!D32,\"\"),\"\")","v":""},{"$f":"IF(F1form!D32<>\"\",IF(F1form!D32<>0,F1form!H32,\"\"),\"\")","v":""},{"$f":"IF(F1form!D32<>\"\",IF(F1form!D32<>0,F1form!I32,\"\"),\"\")","v":""},"",{"$f":"IF(BS37<>\"\",BW37-COUNTIF($I$35:$BF$44,BS37),\"\")","v":""}]
[null,null,null,null,null,"Diğer f.",null,null,null,null,null,null,null,null,null,null,null,null,null,null,null,null,null,null,null,null,null,null,null,null,null,null,null,null,null,null,null,null,null,null,null,null,null,null,null,null,null,null,null,null,null,null,null,null,null,null,null,null,0,null,null,null,null,null,null,null,null,null,null,"",{"$f":"IF(F1form!C33<>\"\",IF(F1form!C33<>0,F1form!C33,\"\"),\"\")","v":""},{"$f":"IF(F1form!D33<>\"\",IF(F1form!D33<>0,F1form!D33,\"\"),\"\")","v":""},{"$f":"IF(F1form!D33<>\"\",IF(F1form!D33<>0,F1form!H33,\"\"),\"\")","v":""},{"$f":"IF(F1form!D33<>\"\",IF(F1form!D33<>0,F1form!I33,\"\"),\"\")","v":""},"",""]
[null,"Çarşamba",null,null,null,"Teorik",null,null,null,null,null,null,null,null,null,null,null,null,null,null,null,null,null,null,null,null,null,null,null,null,null,null,null,null,null,null,null,null,null,null,null,null,null,null,null,null,null,null,null,null,null,null,null,null,null,null,null,null,0,null,null,null,null,null,null,null,null,null,null,"",{"$f":"IF(F1form!C34<>\"\",IF(F1form!C34<>0,F1form!C34,\"\"),\"\")","v":""},{"$f":"IF(F1form!D34<>\"\",IF(F1form!D34<>0,F1form!D34,\"\"),\"\")","v":""},{"$f":"IF(F1form!D34<>\"\",IF(F1form!D34<>0,F1form!H34,\"\"),\"\")","v":""},{"$f":"IF(F1form!D34<>\"\",IF(F1form!D34<>0,F1form!I34,\"\"),\"\")","v":""},"",""]
[null,null,null,null,null,"Diğer f.",null,null,null,null,null,null,null,null,null,null,null,null,null,null,null,null,null,null,null,null,null,null,null,null,null,null,null,null,null,null,null,null,null,null,null,null,null,null,null,null,null,null,null,null,null,null,null,null,null,null,null,null,0,null,null,null,null,null,null,null,null,null,null,"",{"$f":"IF(F1form!C35<>\"\",IF(F1form!C35<>0,F1form!C35,\"\"),\"\")","v":""},{"$f":"IF(F1form!D35<>\"\",IF(F1form!D35<>0,F1form!D35,\"\"),\"\")","v":""},{"$f":"IF(F1form!D35<>\"\",IF(F1form!D35<>0,F1form!H35,\"\"),\"\")","v":""},{"$f":"IF(F1form!D35<>\"\",IF(F1form!D35<>0,F1form!I35,\"\"),\"\")","v":""},"",""]
[null,"Perşembe",null,null,null,"Teorik",null,null,null,null,null,null,null,null,null,null,null,null,null,null,null,null,null,null,null,null,null,null,null,null,null,null,null,null,null,null,null,null,null,null,null,null,null,null,null,null,null,null,null,null,null,null,null,null,null,null,null,null,0,null,null,null,null,null,null,null,null,null,null,"",{"$f":"IF(F1form!C36<>\"\",IF(F1form!C36<>0,F1form!C36,\"\"),\"\")","v":""},{"$f":"IF(F1form!D36<>\"\",IF(F1form!D36<>0,F1form!D36,\"\"),\"\")","v":""},{"$f":"IF(F1form!D36<>\"\",IF(F1form!D36<>0,F1form!H36,\"\"),\"\")","v":""},{"$f":"IF(F1form!D36<>\"\",IF(F1form!D36<>0,F1form!I36,\"\"),\"\")","v":""},"",""]
[null,null,null,null,null,"Diğer f.",null,null,null,null,null,null,null,null,null,null,null,null,null,null,null,null,null,null,null,null,null,null,null,null,null,null,null,null,null,null,null,null,null,null,null,null,null,null,null,null,null,null,null,null,null,null,null,null,null,null,null,null,0,null,null,null,null,null,null,null,null,null,null,"",{"$f":"IF(F1form!C37<>\"\",IF(F1form!C37<>0,F1form!C37,\"\"),\"\")","v":""},{"$f":"IF(F1form!D37<>\"\",IF(F1form!D37<>0,F1form!D37,\"\"),\"\")","v":""},{"$f":"IF(F1form!D37<>\"\",IF(F1form!D37<>0,F1form!H37,\"\"),\"\")","v":""},{"$f":"IF(F1form!D37<>\"\",IF(F1form!D37<>0,F1form!I37,\"\"),\"\")","v":""},"",""]
[null,"Cuma",null,null,null,"Teorik",null,null,null,null,null,null,null,null,null,null,null,null,null,null,null,null,null,null,null,null,null,null,null,null,null,null,null,null,null,null,null,null,null,null,null,null,null,null,null,null,null,null,null,null,null,null,null,null,null,null,null,null,0,null,null,null,null,null,null,null,null,null,null,"",{"$f":"IF(F1form!C38<>\"\",IF(F1form!C38<>0,F1form!C38,\"\"),\"\")","v":""},{"$f":"IF(F1form!D38<>\"\",IF(F1form!D38<>0,F1form!D38,\"\"),\"\")","v":""},{"$f":"IF(F1form!D38<>\"\",IF(F1form!D38<>0,F1form!H38,\"\"),\"\")","v":""},{"$f":"IF(F1form!D38<>\"\",IF(F1form!D38<>0,F1form!I38,\"\"),\"\")","v":""},"",""]
[null,null,null,null,null,"Diğer f.",null,null,null,null,null,null,null,null,null,null,null,null,null,null,null,null,null,null,null,null,null,null,null,null,null,null,null,null,null,null,null,null,null,null,null,null,null,null,null,null,null,null,null,null,null,null,null,null,null,null,null,null,0,null,null,null,null,null,null,null,null,null,null,"",{"$f":"IF(F1form!C39<>\"\",IF(F1form!C39<>0,F1form!C39,\"\"),\"\")","v":""},{"$f":"IF(F1form!D39<>\"\",IF(F1form!D39<>0,F1form!D39,\"\"),\"\")","v":""},{"$f":"IF(F1form!D39<>\"\",IF(F1form!D39<>0,F1form!H39,\"\"),\"\")","v":""},{"$f":"IF(F1form!D39<>\"\",IF(F1form!D39<>0,F1form!I39,\"\"),\"\")","v":""},"",""]
[null,null,null,null,null,null,null,null,null,null,null,null,null,null,null,null,null,null,null,null,null,null,null,null,null,null,null,null,null,null,null,null,null,null,null,null,null,null,null,null,null,null,null,null,null,null,null,null,null,null,null,null,null,null,null,null,null,null,null,null,null,null,null,null,null,null,null,null,null,"",{"$f":"IF(F1form!C40<>\"\",IF(F1form!C40<>0,F1form!C40,\"\"),\"\")","v":""},{"$f":"IF(F1form!D40<>\"\",IF(F1form!D40<>0,F1form!D40,\"\"),\"\")","v":""},{"$f":"IF(F1form!D40<>\"\",IF(F1form!D40<>0,F1form!H40,\"\"),\"\")","v":""},{"$f":"IF(F1form!D40<>\"\",IF(F1form!D40<>0,F1form!I40,\"\"),\"\")","v":""},"",""]
[null,null,null,null,null,null,null,null,null,null,null,null,null,null,null,null,null,null,null,null,null,null,null,null,null,null,null,null,null,null,null,null,null,null,null,null,null,null,null,null,null,null,null,null,null,null,null,null,null,null,null,null,null,null,null,null,null,null,null,null,null,null,null,"Teorik","Uyg.",null,null,null,null,null,null,null,{"$f":"SUM(BU36:BU45)","v":0},{"$f":"SUM(BV36:BV45)","v":0},{"$f":"SUM(BW36:BW45)","v":0},{"$f":"SUM(BX36:BX45)","v":0}]
[null,null,"NOT : Bu programi kullana bilmeniz için makrolari etkinleştirin.( Menü>Araçlar>Seçenekler>Güvenlik>makro Güvenliği>Orta)",null,null,null,null,null,null,null,null,null,null,null,null,null,null,null,null,null,null,null,null,null,null,null,null,null,null,null,null,null,null,null,null,null,null,null,null,null,null,null,null,null,null,null,null,null,null,null,null,null,null,null,null,null,null,null,null,null,null,null,null,{"$f":"SUM(BG35,BG37,BG39,BG41,BG43)","v":0},{"$f":"SUM(BG36,BG38,BG40,BG42,BG44)","v":0}]
[null,null,"Programın Yeni versiyonlarını yandaki linkten indirebilirsiniz.",null,null,null,null,null,null,null,null,null,null,null,null,null,null,null,null,null,null,null,null,null,null,null,null,null,null,null,null,null,null,null,null,null,null,null,null,null,null,null,null,"Sari alanlari Kullanıcı Degiştirebilir.",null,null,null,null,null,null,null,null,null,null,null,null,null,null,null,null,null,null,null,null,{"$f":"SUM(BM47,BL47)","v":0},{"$f":"IOGIRIS!BC20","v":""}]
[null,null,"Version: ",null,null,null,null,null,"2024-10-10",null,null,null,null,null,null,null,null,null,null,null,"fdc",null,null,null,null,null,null,null,"http://ceyhan.cu.edu.tr/belgeveform/ekders.xlsm"]
[null,null,null,null,null,null,null,null,null,null,null,null,null,null,null,null,null,null,null,null,null,null,null,null,null,null,null,null,"https://ekders.caydin.com.tr/"]
[null,null,null,null,null,null,null,null,null,null,"Bu Program  Öğr.Gör. Celalettin AYDIN (Ç.Ü. CEYHAN MYO) Tarafindan Yapilmistir."]
[]
[]
[]
[null,null,null,null,null,null,null,null,null,"Ders Saatleri",null,null,null,null,null,1,null,null,null,null,2,null,null,null,null,3,null,null,null,null,4,null,null,null,null,5,null,null,null,null,6,null,null,null,null,7,null,null,null,null,8]
[null,null,null,null,null,null,null,null,null,"Normal Ögretim",null,null,null,null,null,"08:30-09:15",null,null,null,null,"09:30-10:15",null,null,null,null,"10:30-11:15",null,null,null,null,"11:30-12:15",null,null,null,null,"13:00-13:45",null,null,null,null,"14:00-14:45",null,null,null,null,"15:00-15:45",null,null,null,null,"16:00-16:45"]
[null,null,null,null,null,null,null,null,null,"İkinci Ögretim",null,null,null,null,null,"15:00-14:45",null,null,null,null,"16:00-16:45",null,null,null,null,"17:00-17:45",null,null,null,null,"18:00-1845",null,null,null,null,"19:00-19:45",null,null,null,null,"20:00-20:45",null,null,null,null,"21:00-21:45",null,null,null,null,"22:00-22:45"]
[null,null,null,null,null,null,null,null,null,null,null,null,null,null,null,1,null,null,null,null,2,null,null,null,null,3,null,null,null,null,4,null,null,null,null,5,null,null,null,null,6,null,null,null,null,7,null,null,null,null,8]
[null,null,null,null,null,null,null,null,null,null,null,null,null,null,null,"08:30-09:15",null,null,null,null,"09:30-10:15",null,null,null,null,"10:30-11:15",null,null,null,null,"11:30-12:15",null,null,null,null,"13:00-13:45",null,null,null,null,"14:00-14:45",null,null,null,null,"15:00-15:45",null,null,null,null,"16:00-16:45"]
[null,null,null,null,null,null,null,null,null,null,null,null,null,null,null,"15:00-14:45",null,null,null,null,"16:00-16:45",null,null,null,null,"17:00-17:45",null,null,null,null,"18:00-1845",null,null,null,null,"19:00-19:45",null,null,null,null,"20:00-20:45",null,null,null,null,"21:00-21:45",null,null,null,null,"22:00-22:45"]
[]
[]
[]
[]
[]
[]
[]
[]
[]
[]
[]
[]
[]
[]
[]
[]
[]
[]
[]
[]
[]
[]
[]
[]
[]
[]
[]
[]
[]
[]
[]
[]
[]
[]
[]
[]
[]
[]
[]
[]
[]
[]
[]
[]
[]
[]
[]
[]
[]
[]
[]
[]
[]
[]
[]
[]
[]
[]
[]
[]
[]
[]
[]
[]
[]
[]
[]
[]
[]
[]
[]
[]
[]
[]
[]
[]
[]
[]
[]
[]
[]
[]
[]
[]
[]
[]
[]
[]
[]
[]
[]
[]
[]
[]
[]
[]
[]
[]
[]
[]
[]
[]
[]
[]
[]
[]
[]
[]
[]
[]
[]
[]
[]
[]
[]
[]
[]
[]
[]
[]
[]
[]
[]
[]
[]
[]
[]
[]
[]
[]
[]
[]
[]
[]
[]
[]
[]
[]
[]
[]
[]
[]
[]
[]
[]
[]
[]
[]
[]
[]
[]
[]
[]
[]
[]
[]
[]
[]
[]
[]
[]
[]
[]
[]
[]
[]
[]
[]
[]
[]
[]
[]
[]
[]
[]
[]
[]
[]
[]
[]
[]
[]
[]
[]
[]
[]
[]
[]
[]
[]
[]
[]
[]
[]
[]
[]
[]
[]
[]
[]
[]
[]
[]
[]
[]
[]
[]
[]
[]
[]
[]
[]
[]
[]
[]
[]
[]
[]
[]
[]
[]
[]
[]
[]
[]
[]
[]
[]
[]
[]
[]
[]
[]
[]
[]
[]
[]
[]
[]
[]
[]
[]
[]
[]
[]
[]
[]
[]
[]
[]
[]
[]
[]
[]
[]
[]
[]
[]
[]
[]
[]
[]
[]
[]
[]
[]
[]
[]
[]
[]
[]
[]
[]
[]
[]
[]
[]
[]
[]
[]
[]
[]
[]
[]
[]
[]
[]
[]
[]
[]
[]
[]
[]
[]
[]
[]
[]
[]
[]
[]
[]
[]
[]
[]
[]
[]
[]
[]
[]
[]
[]
[]
[]
[]
[]
[]
[]
[]
[]
[]
[]
[]
[]
[]
[]
[]
[]
[]
[]
[]
[]
[]
[]
[]
[]
[]
[]
[]
[]
[]
[]
[]
[]
[]
[]
[]
[]
[]
[]
[]
[]
[]
[]
[]
[]
[]
[]
[]
[]
[]
[]
[]
[]
[]
[]
[]
[]
[]
[]
[]
[]
[]
[]
[]
[]
[]
[]
[]
[]
[]
[]
[]
[]
[]
[]
[]
[]
[]
[]
[]
[]
[]
[]
[]
[]
[]
[]
[]
[]
[]
[]
[]
[]
[]
[]
[]
[]
[]
[]
[]
[]
[]
[]
[]
[]
[]
[]
[]
[]
[]
[]
[]
[]
[]
[]
[]
[]
[]
[]
[]
[]
[]
[]
[]
[]
[]
[]
[]
[]
["Öğr.Gör.Celalettin AYDIN"]

{"sheet":"F1form","index":1,"n_rows":69,"n_cols":21,"rows_kept":69,"cut":false,"hidden":false,"merged":[[43,13,43,14],[44,13,44,14],[22,3,22,4],[34,3,34,4],[40,4,40,5],[41,4,41,5],[35,3,35,4],[36,3,36,4],[37,3,37,4],[38,3,38,4],[33,3,33,4],[31,3,31,4],[30,3,30,4],[32,3,32,4],[49,3,49,6],[49,11,49,14],[4,7,4,9],[9,2,9,3],[9,4,9,8],[9,9,9,16],[6,2,6,16],[7,2,7,3],[7,4,7,8],[7,9,8,10],[7,11,8,12],[7,13,8,13],[11,16,13,16],[12,14,13,14],[11,7,13,7],[11,8,11,14],[0,0,0,18],[1,0,1,18],[2,0,2,18],[3,0,3,18],[7,14,8,16],[8,2,8,3],[8,4,8,8],[30,0,39,0],[11,17,13,17],[39,3,39,4],[11,18,13,18],[12,3,13,4],[12,8,13,8],[25,3,25,4],[11,1,13,1],[11,2,11,4],[11,5,13,5],[12,2,13,2],[11,15,13,15],[12,10,13,10],[12,12,12,13],[19,3,19,4],[12,9,13,9],[4,23,4,26],[21,3,21,4],[11,20,13,20],[27,3,27,4],[11,0,27,0],[12,11,13,11],[14,3,14,4],[15,3,15,4],[18,3,18,4],[26,3,26,4],[11,6,13,6],[16,3,16,4],[20,3,20,4],[23,3,23,4],[24,3,24,4],[17,3,17,4]]}
["T.C"]
["ÇUKUROVA ÜNİVERSİTESİ"]
[]
["ÖĞRETİM ELEMANI DERS YÜKÜ FORMU   (F-1)"]
[null,null,null,null,null,null,{"$f":"'Bilgi-27'!Z3","v":"2025-2026"},"  EĞİTİM ÖĞRETİM YILI",null,null,{"$f":"'Bilgi-27'!Z4","v":"GÜZ"},"YARIYILI"]
[]
[null,null,"ÖĞRETİM ELEMANININ"]
[null,null,"ÜNVANI, ADI SOYADI",null,{"$f":"'Bilgi-27'!Z7 & \" \" & 'Bilgi-27'!Z8","v":"Öğr.Gör. Celalettin AYDIN"},null,null,null,null,"İDARİ GÖREVİ :",null,{"$f":"'Bilgi-27'!Z9","v":0},null,"İMZASI  :"]
[null,null,"KURUM",null,{"$f":"'Bilgi-27'!Z6","v":"Ç.Ü. CEyhan Meslek Yüksekokulu"}]
[null,null,"BÖLÜM",null,{"$f":"'Bilgi-27'!Z10","v":"Bilgisayar Bölümü"}]
[]
["ÖRGÜN ÖĞRETİM","SIRA NO","ÖĞRETİM ÇALIŞMASININ",null,null,"ÖĞRENCİ SAYISI","FAKÜLTE/ENST./YO/MYO/BÖLÜM","TEORİK DERSLER","DİĞER FAALİYETLER",null,null,null,null,null,null,"DERS YÜKÜ","YASAL YÜK","ZORUNLU DERS YUKU","ÖDENECEK SAAT","Kurum içi (1)","*Önce Kurumiçi Yazilmali"]
[null,null,"KODU","ADI",null,null,null,null,"UYGULAMA","LABARA.","SEMİNER","BİTİRME ÇALIŞMASI","TEZ YÖNETİMİ",null,"ARA SINAV"]
[null,null,null,null,null,null,null,null,null,null,null,null,"Y.LİSANS","DOKTORA",null,null,null,null,null,"Kurum dışı (0)"]
[null,1,"BLP 157","Web Tasarımının Temelleri",null,69,"CMYO",2,null,null,null,null,null,null,null,{"$f":"SUM(H15:O15)","v":2},null,null,{"$f":"(Q15-R15)","v":0},1]
[null,2,"BLP 215","Sensörler",null,57,"CMYO",2,null,null,null,null,null,null,null,{"$f":"SUM(H16:O16)","v":2},null,null,{"$f":"(Q16-R16)","v":0},1]
[null,3,null,null,null,null,null,null,null,null,null,null,null,null,null,{"$f":"SUM(H17:O17)","v":0},null,null,0]
[null,4,null,null,null,null,null,null,null,null,null,null,null,null,null,0,null,null,0]
[null,5,null,null,null,null,null,null,null,null,null,null,null,null,null,0,null,null,0]
[null,6,null,null,null,null,null,null,null,null,null,null,null,null,null,0,null,null,0]
[null,7,null,null,null,null,null,null,null,null,null,null,null,null,null,0,null,null,0]
[null,8,null,null,null,null,null,null,null,null,null,null,null,null,null,0,null,null,0]
[null,9,null,null,null,null,null,null,null,null,null,null,null,null,null,0,null,null,0]
[null,10,null,null,null,null,null,null,null,null,null,null,null,null,null,0,null,null,0]
[null,11,null,null,null,null,null,null,null,null,null,null,null,null,null,0,{"$f":"P25","v":0},null,0]
[null,12,null,null,null,null,null,null,null,null,null,null,null,null,null,0,0,null,0]
[null,13,null,null,null,null,null,null,null,null,null,null,null,null,null,0,0,null,0]
[null,14,"  ",null,null,null,null,null,null,null,null,null,null,null,null,0,0,null,0]
[null,null,null,null,"ÖRGÜN ÖĞRETİM TOPLAMI",null,null,{"$f":"SUM(H15:H28)","v":4},0,0,0,0,0,0,0,4,4,{"$f":"SUM(R15:R28)","v":0},0]
[]
["II. ÖĞRETİM",1,null,null,null,null,null,null,null,null,null,null,null,null,null,{"$f":"SUM(H31:O31)","v":0},{"$f":"P31","v":0},0,{"$f":"(Q31-R31)","v":0}]
[null,2,null,null,null,null,null,null,null,null,null,null,null,null,null,{"$f":"SUM(H32:O32)","v":0},{"$f":"P32","v":0},0,{"$f":"(Q32-R32)","v":0}]
[null,3,null,null,null,null,null,null,null,null,null,null,null,null,null,{"$f":"SUM(H33:O33)","v":0},0,0,{"$f":"(Q33-R33)","v":0}]
[null,4,null,null,null,null,null,null,null,null,null,null,null,null,null,0,null,null,0]
[null,5,null,null,null,null,null,null,null,null,null,null,null,null,null,0,null,null,0]
[null,6,null,null,null,null,null,null,null,null,null,null,null,null,null,0,0,0,0]
[null,7,null,null,null,null,null,null,null,null,null,null,null,null,null,0,null,null,0]
[null,8,null,null,null,null,null,null,null,null,null,null,null,null,null,0,null,null,0,0]
[null,9,null,null,null,null,null,null,null,null,null,null,null,null,null,0,null,null,0,0]
[null,10,null,null,null,null,null,null,null,null,null,null,null,null,null,0,null,null,0,0]
[null,null,null,null,"II.ÖĞRETİM TOPLAMI",null,null,{"$f":"SUM(H31:H40)","v":0},{"$f":"SUM(I31:I40)","v":0},{"$f":"SUM(J31:J40)","v":0},0,0,0,0,0,0,0,{"$f":"SUM(R31:R40)","v":0},{"$f":"IF(SUM(S31:S40)>10,10,SUM(S31:S40))","v":0}]
[null,null,null,null,"GENEL TOPLAM",null,null,{"$f":"SUM(H29+H41)","v":4},0,0,0,0,0,0,0,4,4,{"$f":"R29+R41","v":0},0]
[]
[null,null,null,null,null,null,{"$f":"IF('Bilgi-27'!Z11=\"Müdür\",UPPER('Bilgi-27'!Z11&\"lük\"),UPPER('Bilgi-27'!Z11&\"lık\")  )","v":"MÜDÜRLÜK"},null,null,null,null,null,null,"Zor.Ders.Yük.(Nor)",null,{"$f":"IF(Q44=\"\",0,IF(Q44=0,R42,Q44))","v":4},4,null,null,"Bosluk=0"]
[null,null,null,null,null,null,null,null,null,null,null,null,null,"Zor.Ders.Yük.(İki.)",null,{"$f":"IF(Q45=\"\",0,IF(Q45=0,R41,Q45))","v":0},null,null,null,"0        =Zorun dersl yuk"]
[null,null,"Yukarıda ünvanı, adı, soyadı yazılı öğretim elemanının formda beyanı yapılan öğretim çalışmalarını gerçekleştirme ve ders yükü çalışmaları karşılığında kendisine ek ders ücreti ",null,null,null,null,null,null,null,null,null,null,null,null,null,null,null,null,"deger  =deger"]
[null,"ödenmesini 2914 sayılı kanunun 11. maddesi gereğince onaylarınıza arz ederim."]
[null,null,null,null,"......../....../.........",null,null,null,null,null,null,null,"......../....../........."]
[null,null,null,null,"BÖLÜM BAŞKANI",null,null,null,null,null,null,null,"UYGUNDUR"]
[null,null,null,{"$f":"'Bilgi-27'!Z13","v":"Ögr. Gör. Celalettin AYDIN"},null,null,null,null,null,null,null,{"$f":"'Bilgi-27'!Z12","v":"Prof. Dr. Mutlu AVCI"}]
[]
[]
[]
[]
[]
[]
[]
[null,"sn","normal","kurum dişi",null,null,null,"sn","ikili","kurum dişi"]
[null,"sn","dersin kodu","dersin adi","teorik","uygulama",null,"sn","dersin kodu","dersin adi","teorik","uygulama"]
[null,1,null,null,null,null,null,1]
[null,2,null,null,null,null,null,2]
[null,3,null,null,null,null,null,3]
[null,4,null,null,null,null,null,4]
[null,5,null,null,null,null,null,5]
[null,6,null,null,null,null,null,6]
[null,7,null,null,null,null,null,7]
[null,8,null,null,null,null,null,8]
[null,9,null,null,null,null,null,9]
[null,10,null,null,null,null,null,10]

{"sheet":"F1form-y","index":2,"n_rows":51,"n_cols":17,"rows_kept":51,"cut":false,"hidden":false,"merged":[[0,3,4,11],[5,0,5,16],[7,2,7,16],[8,2,10,3],[8,4,10,7],[8,8,13,9],[8,10,13,11],[8,12,10,16],[11,2,13,3],[11,4,13,7],[11,12,13,16],[14,0,14,16],[15,0,27,0],[15,1,17,1],[15,2,15,3],[15,4,17,4],[15,5,17,5],[15,6,17,6],[15,7,15,13],[15,14,17,14],[40,0,40,16],[15,15,17,15],[15,16,17,16],[16,2,17,2],[16,3,17,3],[16,7,17,7],[16,8,17,8],[16,9,17,9],[16,10,17,10],[16,11,16,12],[16,13,17,13],[28,0,28,5],[29,0,29,16],[30,0,36,0],[37,0,37,5],[38,0,38,5],[50,3,53,4],[50,5,53,8],[50,9,53,12],[42,0,42,16],[44,0,44,5],[44,10,44,16],[45,0,45,5],[45,10,45,16],[46,0,46,5],[46,10,46,16],[47,12,47,13]]}
[null,null,null,{"$f":"\"T.C.\" & _xlfn.UNICHAR(13) & _xlfn.UNICHAR(10) &\n \"ÇUKUROVA ÜNİVERSİTESİ \" & _xlfn.UNICHAR(13) & _xlfn.UNICHAR(10) &\nUPPER(IF('Bilgi-27'!Z11=\"Müdür\",'Bilgi-27'!Z6 &\" MÜDÜRLÜĞÜ\",'Bilgi-27'!Z6 & \" DEKANLIĞI\") )&\n\"\"& _xlfn.UNICHAR(13) & _xlfn.UNICHAR(10) &\n\"Öğretim Elemanı Ders Yükü Formu (F-1)\"","v":"T.C.\r\nÇUKUROVA ÜNİVERSİTESİ \r\nÇ.Ü. CEYHAN MESLEK YÜKSEKOKULU MÜDÜRLÜĞÜ\r\nÖğretim Elemanı Ders Yükü Formu (F-1)"},null,null,null,null,null,null,null,null,"Doküman No ","FRM-SGDB-0008"]
[null,null,null,null,null,null,null,null,null,null,null,null,"İlk Yayın Tarihi ","2024-07-16"]
[null,null,null,null,null,null,null,null,null,null,null,null,"Revizyon Tarihi "]
[null,null,null,null,null,null,null,null,null,null,null,null,"Revizyon No "]
[null,null,null,null,null,null,null,null,null,null,null,null,"Sayfa No"]
[{"$f":"'Bilgi-27'!Z3 &\" EĞİTİM ÖĞRETİM YILI \" & 'Bilgi-27'!Z4&\" YARIYILI\"","v":"2025-2026 EĞİTİM ÖĞRETİM YILI GÜZ YARIYILI"}]
[]
[null,null,"ÖĞRETİM ELEMANININ"]
[null,null,"ÜNVANI, ADI SOYADI",null,{"$f":"'Bilgi-27'!Z7 & \" \" & 'Bilgi-27'!Z8","v":"Öğr.Gör. Celalettin AYDIN"},null,null,null,"İDARİ GÖREV",null,{"$f":"IF('Bilgi-27'!Z9=\"\",\"\",'Bilgi-27'!Z9)","v":""},null,"İMZA"]
[]
[]
[null,null,"KURUM VE BÖLÜM",null,{"$f":"'Bilgi-27'!Z6 & \" - \" & 'Bilgi-27'!Z10","v":"Ç.Ü. CEyhan Meslek Yüksekokulu - Bilgisayar Bölümü"}]
[]
[]
[]
["ÖRGÜN ÖĞRETİM","SIRA NO","ÖĞRETİM ÇALIŞMASININ",null,"ÖĞRENCİ SAYISI","FAKÜLTE / ENST./ YO / MYO / BÖLÜM","TEORİK DERSLER","DİĞER FAALİYETLER",null,null,null,null,null,null,"DERS YÜKÜ","YASAL YÜK","ÖDENECEK SAAT"]
[null,null,"KODU","ADI",null,null,null,"UYGULAMA","LAB.","SEMİNER","BİTİRME ÇALIŞMASI","TEZ YÖNETİMİ",null,"ARA SINAV"]
[null,null,null,null,null,null,null,null,null,null,null,"Y.LİSANS","DOKTORA"]
[null,1,{"$f":"F1form!C15","v":"BLP 157"},{"$f":"F1form!D15","v":"Web Tasarımının Temelleri"},{"$f":"F1form!F15","v":69},{"$f":"F1form!G15","v":"CMYO"},{"$f":"F1form!H15","v":2},{"$f":"F1form!I15","v":0},{"$f":"F1form!J15","v":0},{"$f":"F1form!K15","v":0},{"$f":"F1form!L15","v":0},{"$f":"F1form!M15","v":0},{"$f":"F1form!N15","v":0},{"$f":"F1form!O15","v":0},{"$f":"F1form!P15","v":2},{"$f":"F1form!Q15","v":0},{"$f":"F1form!S15","v":0}]
[null,2,{"$f":"F1form!C16","v":"BLP 215"},{"$f":"F1form!D16","v":"Sensörler"},{"$f":"F1form!F16","v":57},{"$f":"F1form!G16","v":"CMYO"},{"$f":"F1form!H16","v":2},{"$f":"F1form!I16","v":0},{"$f":"F1form!J16","v":0},{"$f":"F1form!K16","v":0},{"$f":"F1form!L16","v":0},{"$f":"F1form!M16","v":0},{"$f":"F1form!N16","v":0},{"$f":"F1form!O16","v":0},{"$f":"F1form!P16","v":2},{"$f":"F1form!Q16","v":0},{"$f":"F1form!S16","v":0}]
[null,3,{"$f":"F1form!C17","v":0},{"$f":"F1form!D17","v":0},{"$f":"F1form!F17","v":0},{"$f":"F1form!G17","v":0},{"$f":"F1form!H17","v":0},{"$f":"F1form!I17","v":0},{"$f":"F1form!J17","v":0},{"$f":"F1form!K17","v":0},{"$f":"F1form!L17","v":0},{"$f":"F1form!M17","v":0},{"$f":"F1form!N17","v":0},{"$f":"F1form!O17","v":0},{"$f":"F1form!P17","v":0},{"$f":"F1form!Q17","v":0},{"$f":"F1form!S17","v":0}]
[null,4,{"$f":"F1form!C18","v":0},{"$f":"F1form!D18","v":0},{"$f":"F1form!F18","v":0},{"$f":"F1form!G18","v":0},{"$f":"F1form!H18","v":0},{"$f":"F1form!I18","v":0},{"$f":"F1form!J18","v":0},{"$f":"F1form!K18","v":0},{"$f":"F1form!L18","v":0},{"$f":"F1form!M18","v":0},{"$f":"F1form!N18","v":0},{"$f":"F1form!O18","v":0},{"$f":"F1form!P18","v":0},{"$f":"F1form!Q18","v":0},{"$f":"F1form!S18","v":0}]
[null,5,{"$f":"F1form!C19","v":0},{"$f":"F1form!D19","v":0},{"$f":"F1form!F19","v":0},{"$f":"F1form!G19","v":0},{"$f":"F1form!H19","v":0},{"$f":"F1form!I19","v":0},{"$f":"F1form!J19","v":0},{"$f":"F1form!K19","v":0},{"$f":"F1form!L19","v":0},{"$f":"F1form!M19","v":0},{"$f":"F1form!N19","v":0},{"$f":"F1form!O19","v":0},{"$f":"F1form!P19","v":0},{"$f":"F1form!Q19","v":0},{"$f":"F1form!S19","v":0}]
[null,6,{"$f":"F1form!C20","v":0},{"$f":"F1form!D20","v":0},{"$f":"F1form!F20","v":0},{"$f":"F1form!G20","v":0},{"$f":"F1form!H20","v":0},{"$f":"F1form!I20","v":0},{"$f":"F1form!J20","v":0},{"$f":"F1form!K20","v":0},{"$f":"F1form!L20","v":0},{"$f":"F1form!M20","v":0},{"$f":"F1form!N20","v":0},{"$f":"F1form!O20","v":0},{"$f":"F1form!P20","v":0},{"$f":"F1form!Q20","v":0},{"$f":"F1form!S20","v":0}]
[null,7,{"$f":"F1form!C21","v":0},{"$f":"F1form!D21","v":0},{"$f":"F1form!F21","v":0},{"$f":"F1form!G21","v":0},{"$f":"F1form!H21","v":0},{"$f":"F1form!I21","v":0},{"$f":"F1form!J21","v":0},{"$f":"F1form!K21","v":0},{"$f":"F1form!L21","v":0},{"$f":"F1form!M21","v":0},{"$f":"F1form!N21","v":0},{"$f":"F1form!O21","v":0},{"$f":"F1form!P21","v":0},{"$f":"F1form!Q21","v":0},{"$f":"F1form!S21","v":0}]
[null,8,{"$f":"F1form!C22","v":0},{"$f":"F1form!D22","v":0},{"$f":"F1form!F22","v":0},{"$f":"F1form!G22","v":0},{"$f":"F1form!H22","v":0},{"$f":"F1form!I22","v":0},{"$f":"F1form!J22","v":0},{"$f":"F1form!K22","v":0},{"$f":"F1form!L22","v":0},{"$f":"F1form!M22","v":0},{"$f":"F1form!N22","v":0},{"$f":"F1form!O22","v":0},{"$f":"F1form!P22","v":0},{"$f":"F1form!Q22","v":0},{"$f":"F1form!S22","v":0}]
[null,9,{"$f":"F1form!C23","v":0},{"$f":"F1form!D23","v":0},{"$f":"F1form!F23","v":0},{"$f":"F1form!G23","v":0},{"$f":"F1form!H23","v":0},{"$f":"F1form!I23","v":0},{"$f":"F1form!J23","v":0},{"$f":"F1form!K23","v":0},{"$f":"F1form!L23","v":0},{"$f":"F1form!M23","v":0},{"$f":"F1form!N23","v":0},{"$f":"F1form!O23","v":0},{"$f":"F1form!P23","v":0},{"$f":"F1form!Q23","v":0},{"$f":"F1form!S23","v":0}]
[null,10,{"$f":"F1form!C24","v":0},{"$f":"F1form!D24","v":0},{"$f":"F1form!F24","v":0},{"$f":"F1form!G24","v":0},{"$f":"F1form!H24","v":0},{"$f":"F1form!I24","v":0},{"$f":"F1form!J24","v":0},{"$f":"F1form!K24","v":0},{"$f":"F1form!L24","v":0},{"$f":"F1form!M24","v":0},{"$f":"F1form!N24","v":0},{"$f":"F1form!O24","v":0},{"$f":"F1form!P24","v":0},{"$f":"F1form!Q24","v":0},{"$f":"F1form!S24","v":0}]
["ÖRGÜN ÖĞRETİM TOPLAMI",null,null,null,null,null,{"$f":"SUM(G19:G28)","v":4},0,0,0,0,0,0,0,4,0,0]
[]
[null,1,{"$f":"F1form!C31","v":0},{"$f":"F1form!D31","v":0},{"$f":"F1form!F31","v":0},{"$f":"F1form!G31","v":0},{"$f":"F1form!H31","v":0},{"$f":"F1form!I31","v":0},{"$f":"F1form!J31","v":0},{"$f":"F1form!K31","v":0},{"$f":"F1form!L31","v":0},{"$f":"F1form!M31","v":0},{"$f":"F1form!N31","v":0},{"$f":"F1form!O31","v":0},{"$f":"F1form!P31","v":0},{"$f":"F1form!Q31","v":0},{"$f":"F1form!S31","v":0}]
[null,2,{"$f":"F1form!C32","v":0},{"$f":"F1form!D32","v":0},{"$f":"F1form!F32","v":0},{"$f":"F1form!G32","v":0},{"$f":"F1form!H32","v":0},{"$f":"F1form!I32","v":0},{"$f":"F1form!J32","v":0},{"$f":"F1form!K32","v":0},{"$f":"F1form!L32","v":0},{"$f":"F1form!M32","v":0},{"$f":"F1form!N32","v":0},{"$f":"F1form!O32","v":0},{"$f":"F1form!P32","v":0},{"$f":"F1form!Q32","v":0},{"$f":"F1form!S32","v":0}]
[null,3,{"$f":"F1form!C33","v":0},{"$f":"F1form!D33","v":0},{"$f":"F1form!F33","v":0},{"$f":"F1form!G33","v":0},{"$f":"F1form!H33","v":0},{"$f":"F1form!I33","v":0},{"$f":"F1form!J33","v":0},{"$f":"F1form!K33","v":0},{"$f":"F1form!L33","v":0},{"$f":"F1form!M33","v":0},{"$f":"F1form!N33","v":0},{"$f":"F1form!O33","v":0},{"$f":"F1form!P33","v":0},{"$f":"F1form!Q33","v":0},{"$f":"F1form!S33","v":0}]
[null,4,{"$f":"F1form!C34","v":0},{"$f":"F1form!D34","v":0},{"$f":"F1form!F34","v":0},{"$f":"F1form!G34","v":0},{"$f":"F1form!H34","v":0},{"$f":"F1form!I34","v":0},{"$f":"F1form!J34","v":0},{"$f":"F1form!K34","v":0},{"$f":"F1form!L34","v":0},{"$f":"F1form!M34","v":0},{"$f":"F1form!N34","v":0},{"$f":"F1form!O34","v":0},{"$f":"F1form!P34","v":0},{"$f":"F1form!Q34","v":0},{"$f":"F1form!S34","v":0}]
[null,5,{"$f":"F1form!C35","v":0},{"$f":"F1form!D35","v":0},{"$f":"F1form!F35","v":0},{"$f":"F1form!G35","v":0},{"$f":"F1form!H35","v":0},{"$f":"F1form!I35","v":0},{"$f":"F1form!J35","v":0},{"$f":"F1form!K35","v":0},{"$f":"F1form!L35","v":0},{"$f":"F1form!M35","v":0},{"$f":"F1form!N35","v":0},{"$f":"F1form!O35","v":0},{"$f":"F1form!P35","v":0},{"$f":"F1form!Q35","v":0},{"$f":"F1form!S35","v":0}]
[null,6,{"$f":"F1form!C36","v":0},{"$f":"F1form!D36","v":0},{"$f":"F1form!F36","v":0},{"$f":"F1form!G36","v":0},{"$f":"F1form!H36","v":0},{"$f":"F1form!I36","v":0},{"$f":"F1form!J36","v":0},{"$f":"F1form!K36","v":0},{"$f":"F1form!L36","v":0},{"$f":"F1form!M36","v":0},{"$f":"F1form!N36","v":0},{"$f":"F1form!O36","v":0},{"$f":"F1form!P36","v":0},{"$f":"F1form!Q36","v":0},{"$f":"F1form!S36","v":0}]
[null,7,{"$f":"F1form!C37","v":0},{"$f":"F1form!D37","v":0},{"$f":"F1form!F37","v":0},{"$f":"F1form!G37","v":0},{"$f":"F1form!H37","v":0},{"$f":"F1form!I37","v":0},{"$f":"F1form!J37","v":0},{"$f":"F1form!K37","v":0},{"$f":"F1form!L37","v":0},{"$f":"F1form!M37","v":0},{"$f":"F1form!N37","v":0},{"$f":"F1form!O37","v":0},{"$f":"F1form!P37","v":0},{"$f":"F1form!Q37","v":0},{"$f":"F1form!S37","v":0}]
[" II.ÖĞRETİM TOPLAMI",null,null,null,null,null,{"$f":"SUM(G31:G37)","v":0},{"$f":"SUM(H31:H37)","v":0},0,0,{"$f":"SUM(K31:K37)","v":0},{"$f":"SUM(L31:L37)","v":0},{"$f":"SUM(M31:M37)","v":0},{"$f":"SUM(N31:N37)","v":0},{"$f":"SUM(O31:O37)","v":0},{"$f":"SUM(P31:P37)","v":0},{"$f":"SUM(Q31:Q37)","v":0}]
["GENEL TOPLAM",null,null,null,null,null,{"$f":"SUM(G38,G29)","v":4},{"$f":"SUM(H38,H29)","v":0},0,0,0,0,0,0,4,0,0]
[]
[{"$f":"F1form!G44","v":"MÜDÜRLÜK"}]
[]
["                                                       Yukarıda ünvanı, adı, soyadı yazılı öğretim elemanının formda beyanı yapılan öğretim çalışmalarını gerçekleştirme ve ders yükü çalışmaları karşılığında kendisine ek ders ücreti ödenmesini 2914 sayılı kanunun 11. maddesi gereğince onaylarınıza arz ederim."]
[]
[null,null,null,null,null,null,null,null,null,null,"….../….../…..."]
["…../…../…...",null,null,null,null,null,null,null,null,null,"UYGUNDUR"]
["BÖLÜM BAŞKANI",null,null,null,null,null,null,null,null,null,{"$f":"UPPER('Bilgi-27'!Z11)","v":"MÜDÜR"}]
[null,null,null,{"$f":"'Bilgi-27'!Z13","v":"Ögr. Gör. Celalettin AYDIN"},null,null,null,null,null,null,null,null,{"$f":"F1form!L50","v":"Prof. Dr. Mutlu AVCI"}]
[null,null,null,"İlgili Dokümanlar:"]
[]
[null,null,null,"Hazırlayan\nİlgili Süreç Sahibi",null,"Kontrol Eden\nBirim Yöneticisi",null,null,null,"Onaylayan\nKalite Koordinatörlüğü"]

{"sheet":"NorGiris","index":3,"n_rows":62,"n_cols":63,"rows_kept":62,"cut":false,"hidden":false,"merged":[[1,29,1,38],[3,29,3,35],[12,23,12,27],[0,5,0,45],[25,28,25,31],[7,13,7,17],[7,18,7,22],[11,18,11,22],[25,22,25,23],[17,18,17,22],[17,23,17,27],[10,23,10,27],[15,28,15,32],[1,8,1,27],[4,8,4,20],[12,8,12,12],[11,8,11,12],[8,23,8,27],[17,13,17,17],[9,23,9,27],[11,13,11,17],[11,23,11,27],[10,38,10,42],[10,33,10,37],[35,49,35,52],[34,45,34,48],[40,32,40,44],[39,24,39,26],[29,22,29,23],[36,24,36,26],[30,48,30,49],[37,45,37,48],[40,45,40,48],[40,49,40,52],[38,32,38,44],[38,45,38,48],[31,48,31,49],[40,28,40,31],[30,50,30,51],[45,53,45,56],[44,53,44,56],[43,53,43,56],[38,53,38,56],[41,53,41,56],[42,53,42,56],[40,53,40,56],[39,53,39,56],[2,29,2,38],[16,43,16,47],[39,45,39,48],[17,48,17,52],[25,32,25,47],[25,48,25,49],[16,38,16,42],[17,38,17,42],[31,50,31,51],[30,32,30,47],[39,32,39,44],[33,28,33,56],[38,28,38,31],[34,53,34,56],[34,49,34,52],[42,49,42,52],[2,8,2,12],[8,8,8,12],[8,13,8,17],[8,18,8,22],[9,8,9,12],[4,22,4,28],[9,33,9,37],[9,38,9,42],[7,8,7,12],[8,38,8,42],[7,38,7,42],[2,39,2,48],[8,48,8,52],[9,48,9,52],[7,43,7,47],[7,28,7,32],[6,1,6,47],[7,23,7,27],[7,33,7,37],[8,1,9,4],[8,5,8,7],[9,5,9,7],[9,18,9,22],[9,28,9,32],[12,5,12,7],[12,43,12,47],[35,28,35,31],[35,32,35,44],[11,38,11,42],[11,43,11,47],[35,22,35,23],[35,24,35,26],[14,28,14,32],[15,43,15,47],[14,38,14,42],[14,13,14,17],[21,22,21,23],[14,43,14,47],[13,5,13,7],[13,38,13,42],[11,33,11,37],[11,28,11,32],[13,8,13,12],[12,13,12,17],[12,18,12,22],[13,23,13,27],[13,13,13,17],[35,45,35,48],[8,43,8,47],[14,48,14,52],[15,48,15,52],[15,23,15,27],[21,28,21,31],[24,28,24,31],[34,28,34,44],[40,5,40,19],[40,20,40,21],[39,20,39,21],[39,22,39,23],[15,38,15,42],[15,18,15,22],[17,5,17,7],[17,8,17,12],[14,23,14,27],[14,18,14,22],[36,49,36,52],[26,20,26,21],[29,5,29,19],[14,8,14,12],[15,5,15,7],[29,20,29,21],[31,28,31,47],[35,53,35,56],[10,8,10,12],[15,8,15,12],[16,18,16,22],[12,48,12,52],[13,43,13,47],[13,48,13,52],[13,18,13,22],[16,33,16,37],[12,28,12,32],[12,33,12,37],[12,38,12,42],[17,43,17,47],[10,13,10,17],[10,18,10,22],[13,33,13,37],[13,28,13,32],[15,33,15,37],[14,33,14,37],[10,28,10,32],[10,43,10,47],[23,5,23,19],[24,20,24,21],[11,5,11,7],[15,13,15,17],[35,20,35,21],[14,5,14,7],[1,39,1,48],[14,1,15,4],[10,5,10,7],[3,36,3,48],[16,48,16,52],[20,1,20,4],[16,1,17,4],[16,5,16,7],[9,13,9,17],[1,1,1,7],[2,1,2,7],[3,1,3,7],[4,1,4,7],[7,1,7,7],[10,1,11,4],[2,14,2,18],[3,8,3,12],[8,28,8,32],[8,33,8,37],[9,43,9,47],[25,20,25,21],[42,45,42,48],[41,45,41,48],[36,53,36,56],[38,49,38,52],[37,28,37,31],[37,32,37,44],[37,53,37,56],[36,28,36,31],[36,32,36,44],[36,45,36,48],[39,28,39,31],[39,49,39,52],[37,49,37,52],[43,1,43,4],[43,5,43,19],[43,20,43,21],[43,22,43,23],[41,1,41,4],[42,22,42,23],[44,20,44,21],[45,28,45,52],[43,49,43,52],[44,49,44,52],[43,45,43,48],[44,45,44,48],[41,49,41,52],[45,24,45,26],[44,22,44,23],[41,24,41,26],[42,28,42,31],[42,32,42,44],[41,32,41,44],[41,28,41,31],[44,28,44,31],[43,28,43,31],[43,32,43,44],[44,32,44,44],[31,20,31,21],[27,1,27,4],[27,5,27,19],[27,20,27,21],[27,22,27,23],[26,1,26,4],[26,5,26,19],[37,1,37,4],[37,5,37,19],[31,1,31,19],[25,5,25,19],[29,1,29,4],[16,8,16,12],[16,23,16,27],[19,1,19,23],[20,22,20,23],[16,28,16,32],[17,28,17,32],[24,32,24,47],[21,1,21,4],[22,1,22,4],[21,5,21,19],[22,5,22,19],[22,20,22,21],[24,1,24,4],[24,5,24,19],[22,22,22,23],[22,28,22,31],[21,20,21,21],[23,1,23,4],[24,22,24,23],[23,20,23,21],[23,22,23,23],[23,28,23,31],[12,1,13,4],[16,13,16,17],[17,33,17,37],[10,48,10,52],[11,48,11,52],[6,48,7,52],[30,1,30,4],[30,5,30,19],[28,32,28,47],[28,1,28,4],[28,5,28,19],[28,20,28,21],[29,28,29,31],[20,50,20,51],[27,32,27,47],[27,48,27,49],[23,48,23,49],[19,28,19,51],[20,48,20,49],[27,50,27,51],[26,50,26,51],[23,50,23,51],[26,28,26,31],[25,1,25,4],[21,48,21,49],[21,50,21,51],[22,32,22,47],[22,48,22,49],[25,50,25,51],[29,48,29,49],[24,50,24,51],[28,50,28,51],[26,32,26,47],[26,48,26,49],[28,48,28,49],[24,48,24,49],[23,32,23,47],[46,7,46,16],[34,20,34,21],[34,22,34,23],[27,28,27,31],[29,50,29,51],[29,32,29,47],[30,28,30,31],[28,22,28,23],[26,22,26,23],[38,5,38,19],[38,20,38,21],[38,22,38,23],[38,24,38,26],[45,20,45,21],[44,24,44,26],[43,24,43,26],[42,24,42,26],[41,5,41,19],[42,5,42,19],[41,20,41,21],[41,22,41,23],[45,22,45,23],[40,24,40,26],[40,22,40,23],[39,1,39,4],[39,5,39,19],[37,20,37,21],[37,22,37,23],[37,24,37,26],[36,1,36,4],[36,5,36,19],[34,24,34,26],[42,20,42,21],[38,1,38,4],[42,1,42,4],[19,54,19,61],[46,1,46,6],[47,1,47,6],[20,5,20,19],[22,50,22,51],[20,20,20,21],[21,32,21,47],[20,28,20,31],[20,32,20,47],[28,28,28,31],[47,7,47,16],[30,22,30,23],[30,20,30,21],[45,1,45,19],[44,1,44,4],[44,5,44,19],[36,20,36,21],[36,22,36,23],[40,1,40,4],[35,1,35,4],[35,5,35,19],[34,1,34,19],[33,1,33,26],[31,22,31,23]]}
[null,null,null,null,null,{"$f":"'Bilgi-27'!K51","v":"Bu Program  Öğr.Gör. Celalettin AYDIN (Ç.Ü. CEYHAN MYO) Tarafindan Yapilmistir."}]
[null,"KURUM",null,null,null,null,null,null,{"$f":"F1form!E9","v":"Ç.Ü. CEyhan Meslek Yüksekokulu"},null,null,null,null,null,null,null,null,null,null,null,null,null,null,null,null,null,null,null,null,"İDARİ GÖREVİ",null,null,null,null,null,null,null,null,null,{"$f":"F1form!L8","v":0}]
[null,"DÖNEM TARİH",null,null,null,null,null,null,{"$f":"'Bilgi-27'!N15","v":"2025-09-27"},null,null,null,null,"-",{"$f":"'Bilgi-27'!T15","v":"2025-10-01"},null,null,null,null,null,null,null,null,null,null,null,null,null,null,"ZORUNLU DERS YÜKÜ",null,null,null,null,null,null,null,null,null,{"$f":"F1form!P44","v":4}]
[null,"HAFTA SAYISI",null,null,null,null,null,null,{"$f":"'Bilgi-27'!N16","v":1},null,null,null,null,null,null,null,null,null,null,null,null,null,null,null,null,null,null,null,null,"BÖLÜMÜ",null,null,null,null,null,null,{"$f":"F1form!E10","v":"Bilgisayar Bölümü"}]
[null,"ADI SOYADI",null,null,null,null,null,null,{"$f":"F1form!E8","v":"Öğr.Gör. Celalettin AYDIN"},null,null,null,null,null,null,null,null,null,null,null,null,null,"Normal Öğretim"]
[]
[null,"Haftalık Ders Programı",null,null,null,null,null,null,null,null,null,null,null,null,null,null,null,null,null,null,null,null,null,null,null,null,null,null,null,null,null,null,null,null,null,null,null,null,null,null,null,null,null,null,null,null,null,null,"TOPLAM"]
[null,"Günler",null,null,null,null,null,null,{"$f":"'Bilgi-27'!I20:M20","v":"08:30-09:15"},null,null,null,null,{"$f":"'Bilgi-27'!N20:R20","v":"09:30-10:15"},null,null,null,null,{"$f":"'Bilgi-27'!S20:W20","v":"10:30-11:15"},null,null,null,null,{"$f":"'Bilgi-27'!X20:AB20","v":"11:30-12:15"},null,null,null,null,{"$f":"'Bilgi-27'!AC20:AG20","v":"13:00-13:45"},null,null,null,null,{"$f":"'Bilgi-27'!AH20:AL20","v":"14:00-14:45"},null,null,null,null,{"$f":"'Bilgi-27'!AM20:AQ20","v":"15:00-15:45"},null,null,null,null,{"$f":"'Bilgi-27'!AR20:AV20","v":"16:00-16:45"}]
[null,"Pazartesi",null,null,null,"Teorik",null,null,{"$f":"'Bilgi-27'!I21","v":0},null,null,null,null,{"$f":"'Bilgi-27'!N21","v":0},null,null,null,null,{"$f":"'Bilgi-27'!S21","v":0},null,null,null,null,{"$f":"'Bilgi-27'!X21","v":0},null,null,null,null,{"$f":"'Bilgi-27'!AC21","v":0},null,null,null,null,{"$f":"'Bilgi-27'!AH21","v":0},null,null,null,null,{"$f":"'Bilgi-27'!AM21","v":0},null,null,null,null,{"$f":"'Bilgi-27'!AR21","v":0},null,null,null,null,{"$f":"'Bilgi-27'!AW21","v":0}]
[null,null,null,null,null,"Diğer f.",null,null,{"$f":"'Bilgi-27'!I22","v":0},null,null,null,null,{"$f":"'Bilgi-27'!N22","v":0},null,null,null,null,{"$f":"'Bilgi-27'!S22","v":0},null,null,null,null,{"$f":"'Bilgi-27'!X22","v":0},null,null,null,null,{"$f":"'Bilgi-27'!AC22","v":0},null,null,null,null,{"$f":"'Bilgi-27'!AH22","v":0},null,null,null,null,{"$f":"'Bilgi-27'!AM22","v":0},null,null,null,null,{"$f":"'Bilgi-27'!AR22","v":0},null,null,null,null,{"$f":"'Bilgi-27'!AW22","v":0}]
[null,"Salı",null,null,null,"Teorik",null,null,{"$f":"'Bilgi-27'!I23","v":0},null,null,null,null,{"$f":"'Bilgi-27'!N23","v":0},null,null,null,null,{"$f":"'Bilgi-27'!S23","v":0},null,null,null,null,{"$f":"'Bilgi-27'!X23","v":0},null,null,null,null,{"$f":"'Bilgi-27'!AC23","v":0},null,null,null,null,{"$f":"'Bilgi-27'!AH23","v":0},null,null,null,null,{"$f":"'Bilgi-27'!AM23","v":0},null,null,null,null,{"$f":"'Bilgi-27'!AR23","v":0},null,null,null,null,{"$f":"'Bilgi-27'!AW23","v":0}]
[null,null,null,null,null,"Diğer f.",null,null,{"$f":"'Bilgi-27'!I24","v":0},null,null,null,null,{"$f":"'Bilgi-27'!N24","v":0},null,null,null,null,{"$f":"'Bilgi-27'!S24","v":0},null,null,null,null,{"$f":"'Bilgi-27'!X24","v":0},null,null,null,null,{"$f":"'Bilgi-27'!AC24","v":0},null,null,null,null,{"$f":"'Bilgi-27'!AH24","v":0},null,null,null,null,{"$f":"'Bilgi-27'!AM24","v":0},null,null,null,null,{"$f":"'Bilgi-27'!AR24","v":0},null,null,null,null,{"$f":"'Bilgi-27'!AW24","v":0}]
[null,"Çarşamba",null,null,null,"Teorik",null,null,{"$f":"'Bilgi-27'!I25","v":0},null,null,null,null,{"$f":"'Bilgi-27'!N25","v":0},null,null,null,null,{"$f":"'Bilgi-27'!S25","v":0},null,null,null,null,{"$f":"'Bilgi-27'!X25","v":0},null,null,null,null,{"$f":"'Bilgi-27'!AC25","v":0},null,null,null,null,{"$f":"'Bilgi-27'!AH25","v":0},null,null,null,null,{"$f":"'Bilgi-27'!AM25","v":0},null,null,null,null,{"$f":"'Bilgi-27'!AR25","v":0},null,null,null,null,{"$f":"'Bilgi-27'!AW25","v":0}]
[null,null,null,null,null,"Diğer f.",null,null,{"$f":"'Bilgi-27'!I26","v":0},null,null,null,null,{"$f":"'Bilgi-27'!N26","v":0},null,null,null,null,{"$f":"'Bilgi-27'!S26","v":0},null,null,null,null,{"$f":"'Bilgi-27'!X26","v":0},null,null,null,null,{"$f":"'Bilgi-27'!AC26","v":0},null,null,null,null,{"$f":"'Bilgi-27'!AH26","v":0},null,null,null,null,{"$f":"'Bilgi-27'!AM26","v":0},null,null,null,null,{"$f":"'Bilgi-27'!AR26","v":0},null,null,null,null,{"$f":"'Bilgi-27'!AW26","v":0}]
[null,"Perşembe",null,null,null,"Teorik",null,null,{"$f":"'Bilgi-27'!I27","v":0},null,null,null,null,{"$f":"'Bilgi-27'!N27","v":0},null,null,null,null,{"$f":"'Bilgi-27'!S27","v":0},null,null,null,null,{"$f":"'Bilgi-27'!X27","v":0},null,null,null,null,{"$f":"'Bilgi-27'!AC27","v":0},null,null,null,null,{"$f":"'Bilgi-27'!AH27","v":0},null,null,null,null,{"$f":"'Bilgi-27'!AM27","v":0},null,null,null,null,{"$f":"'Bilgi-27'!AR27","v":0},null,null,null,null,{"$f":"'Bilgi-27'!AW27","v":0}]
[null,null,null,null,null,"Diğer f.",null,null,{"$f":"'Bilgi-27'!I28","v":0},null,null,null,null,{"$f":"'Bilgi-27'!N28","v":0},null,null,null,null,{"$f":"'Bilgi-27'!S28","v":0},null,null,null,null,{"$f":"'Bilgi-27'!X28","v":0},null,null,null,null,{"$f":"'Bilgi-27'!AC28","v":0},null,null,null,null,{"$f":"'Bilgi-27'!AH28","v":0},null,null,null,null,{"$f":"'Bilgi-27'!AM28","v":0},null,null,null,null,{"$f":"'Bilgi-27'!AR28","v":0},null,null,null,null,{"$f":"'Bilgi-27'!AW28","v":0}]
[null,"Cuma",null,null,null,"Teorik",null,null,{"$f":"'Bilgi-27'!I29","v":0},null,null,null,null,{"$f":"'Bilgi-27'!N29","v":0},null,null,null,null,{"$f":"'Bilgi-27'!S29","v":"BLP 157"},null,null,null,null,{"$f":"'Bilgi-27'!X29","v":"BLP 157"},null,null,null,null,{"$f":"'Bilgi-27'!AC29","v":"BLP 215"},null,null,null,null,{"$f":"'Bilgi-27'!AH29","v":"BLP 215"},null,null,null,null,{"$f":"'Bilgi-27'!AM29","v":0},null,null,null,null,{"$f":"'Bilgi-27'!AR29","v":0},null,null,null,null,{"$f":"'Bilgi-27'!AW29","v":4},null,null,null,null,null,{"$f":"SUM(AW17:BB17,AW15,AW13,AW11,AW9)","v":4},{"$f":"SUM(AW18,AW16,AW14,AW12,AW10)","v":0}]
[null,null,null,null,null,"Diğer f.",null,null,{"$f":"'Bilgi-27'!I30","v":0},null,null,null,null,{"$f":"'Bilgi-27'!N30","v":0},null,null,null,null,{"$f":"'Bilgi-27'!S30","v":0},null,null,null,null,{"$f":"'Bilgi-27'!X30","v":0},null,null,null,null,{"$f":"'Bilgi-27'!AC30","v":0},null,null,null,null,{"$f":"'Bilgi-27'!AH30","v":0},null,null,null,null,{"$f":"'Bilgi-27'!AM30","v":0},null,null,null,null,{"$f":"'Bilgi-27'!AR30","v":0},null,null,null,null,{"$f":"'Bilgi-27'!AW30","v":0},null,null,null,null,null,null,{"$f":"SUM(BC17:BD17)","v":4},null,null,null,null,null,null,{"$f":"IF(U32=BC17,1,0)","v":1}]
[null,null,null,null,null,null,null,null,null,null,null,null,null,null,null,null,null,null,null,null,null,null,null,null,null,null,null,null,null,null,null,null,null,null,null,null,null,null,null,null,null,null,null,null,null,null,null,null,null,null,null,null,null,null,null,null,null,null,null,null,null,null,{"$f":"IF(W32=BD17,1,0)","v":1}]
[null,"Çizelge 2- Ders Yükleri",null,null,null,null,null,null,null,null,null,null,null,null,null,null,null,null,null,null,null,null,null,null,null,null,null,null,"Çizlge 3- Diğer Fakülte ve Yüksekokullarda",null,null,null,null,null,null,null,null,null,null,null,null,null,null,null,null,null,null,null,null,null,null,null,null,null,{"$f":"IF(BK18*BK19=0,\"Hatali Giriş\",\"\")","v":""}]
[null,"Der.Kodu",null,null,null,"Dersin Adı",null,null,null,null,null,null,null,null,null,null,null,null,null,null,"Teo.",null,"Diğ.",null,null,null,null,null,"Der.Kodu",null,null,null,"Dersin Adı",null,null,null,null,null,null,null,null,null,null,null,null,null,null,null,"Teo.",null,"Diğ."]
[1,{"$f":"IF(F1form!T15=1,F1form!C15,\"\")","v":"BLP 157"},null,null,null,{"$f":"IF(F1form!T15=1,F1form!D15,\"\")","v":"Web Tasarımının Temelleri"},null,null,null,null,null,null,null,null,null,null,null,null,null,null,{"$f":"IF(F1form!T15=1,F1form!H15,\"\")","v":2},null,{"$f":"IF(F1form!T15=1,F1form!I15,\"\")","v":0},null,null,null,null,null,{"$f":"F1form!C60","v":0},null,null,null,{"$f":"F1form!D60","v":0},null,null,null,null,null,null,null,null,null,null,null,null,null,null,null,{"$f":"F1form!E60","v":0},null,{"$f":"F1form!F60","v":0}]
[2,{"$f":"IF(F1form!T16=1,F1form!C16,\"\")","v":"BLP 215"},null,null,null,{"$f":"IF(F1form!T16=1,F1form!D16,\"\")","v":"Sensörler"},null,null,null,null,null,null,null,null,null,null,null,null,null,null,{"$f":"IF(F1form!T16=1,F1form!H16,\"\")","v":2},null,{"$f":"IF(F1form!T16=1,F1form!I16,\"\")","v":0},null,null,null,null,null,{"$f":"F1form!C61","v":0},null,null,null,{"$f":"F1form!D61","v":0},null,null,null,null,null,null,null,null,null,null,null,null,null,null,null,{"$f":"F1form!E61","v":0},null,{"$f":"F1form!F61","v":0}]
[3,{"$f":"IF(F1form!T17=1,F1form!C17,\"\")","v":""},null,null,null,{"$f":"IF(F1form!T17=1,F1form!D17,\"\")","v":""},null,null,null,null,null,null,null,null,null,null,null,null,null,null,{"$f":"IF(F1form!T17=1,F1form!H17,\"\")","v":""},null,{"$f":"IF(F1form!T17=1,F1form!I17,\"\")","v":""},null,null,null,null,null,{"$f":"F1form!C62","v":0},null,null,null,{"$f":"F1form!D62","v":0},null,null,null,null,null,null,null,null,null,null,null,null,null,null,null,{"$f":"F1form!E62","v":0},null,{"$f":"F1form!F62","v":0}]
[4,{"$f":"IF(F1form!T18=1,F1form!C18,\"\")","v":""},null,null,null,{"$f":"IF(F1form!T18=1,F1form!D18,\"\")","v":""},null,null,null,null,null,null,null,null,null,null,null,null,null,null,{"$f":"IF(F1form!T18=1,F1form!H18,\"\")","v":""},null,{"$f":"IF(F1form!T18=1,F1form!I18,\"\")","v":""},null,null,null,null,null,{"$f":"F1form!C63","v":0},null,null,null,{"$f":"F1form!D63","v":0},null,null,null,null,null,null,null,null,null,null,null,null,null,null,null,{"$f":"F1form!E63","v":0},null,{"$f":"F1form!F63","v":0}]
[5,{"$f":"IF(F1form!T19=1,F1form!C19,\"\")","v":""},null,null,null,{"$f":"IF(F1form!T19=1,F1form!D19,\"\")","v":""},null,null,null,null,null,null,null,null,null,null,null,null,null,null,{"$f":"IF(F1form!T19=1,F1form!H19,\"\")","v":""},null,{"$f":"IF(F1form!T19=1,F1form!I19,\"\")","v":""},null,null,null,null,null,{"$f":"F1form!C64","v":0},null,null,null,{"$f":"F1form!D64","v":0},null,null,null,null,null,null,null,null,null,null,null,null,null,null,null,{"$f":"F1form!E64","v":0},null,{"$f":"F1form!F64","v":0}]
[6,{"$f":"IF(F1form!T20=1,F1form!C20,\"\")","v":""},null,null,null,{"$f":"IF(F1form!T20=1,F1form!D20,\"\")","v":""},null,null,null,null,null,null,null,null,null,null,null,null,null,null,{"$f":"IF(F1form!T20=1,F1form!H20,\"\")","v":""},null,{"$f":"IF(F1form!T20=1,F1form!I20,\"\")","v":""},null,null,null,null,null,{"$f":"F1form!C65","v":0},null,null,null,{"$f":"F1form!D65","v":0},null,null,null,null,null,null,null,null,null,null,null,null,null,null,null,{"$f":"F1form!E65","v":0},null,{"$f":"F1form!F65","v":0}]
[7,{"$f":"IF(F1form!T21=1,F1form!C21,\"\")","v":""},null,null,null,{"$f":"IF(F1form!T21=1,F1form!D21,\"\")","v":""},null,null,null,null,null,null,null,null,null,null,null,null,null,null,{"$f":"IF(F1form!T21=1,F1form!H21,\"\")","v":""},null,{"$f":"IF(F1form!T21=1,F1form!I21,\"\")","v":""},null,null,null,null,null,{"$f":"F1form!C66","v":0},null,null,null,{"$f":"F1form!D66","v":0},null,null,null,null,null,null,null,null,null,null,null,null,null,null,null,{"$f":"F1form!E66","v":0},null,{"$f":"F1form!F66","v":0}]
[8,{"$f":"IF(F1form!T22=1,F1form!C22,\"\")","v":""},null,null,null,{"$f":"IF(F1form!T22=1,F1form!D22,\"\")","v":""},null,null,null,null,null,null,null,null,null,null,null,null,null,null,{"$f":"IF(F1form!T22=1,F1form!H22,\"\")","v":""},null,{"$f":"IF(F1form!T22=1,F1form!I22,\"\")","v":""},null,null,null,null,null,{"$f":"F1form!C67","v":0},null,null,null,{"$f":"F1form!D67","v":0},null,null,null,null,null,null,null,null,null,null,null,null,null,null,null,{"$f":"F1form!E67","v":0},null,{"$f":"F1form!F67","v":0}]
[9,{"$f":"IF(F1form!T23=1,F1form!C23,\"\")","v":""},null,null,null,{"$f":"IF(F1form!T23=1,F1form!D23,\"\")","v":""},null,null,null,null,null,null,null,null,null,null,null,null,null,null,{"$f":"IF(F1form!T23=1,F1form!H23,\"\")","v":""},null,{"$f":"IF(F1form!T23=1,F1form!I23,\"\")","v":""},null,null,null,null,null,{"$f":"F1form!C68","v":0},null,null,null,{"$f":"F1form!D68","v":0},null,null,null,null,null,null,null,null,null,null,null,null,null,null,null,{"$f":"F1form!E68","v":0},null,{"$f":"F1form!F68","v":0}]
[10,{"$f":"IF(F1form!T24=1,F1form!C24,\"\")","v":""},null,null,null,{"$f":"IF(F1form!T24=1,F1form!D24,\"\")","v":""},null,null,null,null,null,null,null,null,null,null,null,null,null,null,{"$f":"IF(F1form!T24=1,F1form!H24,\"\")","v":""},null,{"$f":"IF(F1form!T24=1,F1form!I24,\"\")","v":""},null,null,null,null,null,{"$f":"F1form!C69","v":0},null,null,null,{"$f":"F1form!D69","v":0},null,null,null,null,null,null,null,null,null,null,null,null,null,null,null,{"$f":"F1form!E69","v":0},null,{"$f":"F1form!F69","v":0}]
[null,"TOPLAM",null,null,null,null,null,null,null,null,null,null,null,null,null,null,null,null,null,null,{"$f":"SUM(U22:V31)","v":4},null,{"$f":"SUM(W22:X31)","v":0},null,null,null,null,null,"TOPLAM",null,null,null,null,null,null,null,null,null,null,null,null,null,null,null,null,null,null,null,{"$f":"SUM(AW22:AX31)","v":0},null,{"$f":"SUM(AY22:AZ31)","v":0}]
[]
[null,"Çizelge 4- Yapılmayan Dersler",null,null,null,null,null,null,null,null,null,null,null,null,null,null,null,null,null,null,null,null,null,null,null,null,null,null,"Çizlge 5- Ara Sınavlar"]
[null,"Der.Kodu ve Adı",null,null,null,null,null,null,null,null,null,null,null,null,null,null,null,null,null,null,"Teo.",null,"Diğ.",null,"Y.Hafta",null,null,null,"Der.Kodu ve Adı",null,null,null,null,null,null,null,null,null,null,null,null,null,null,null,null,"Tarih",null,null,null,"Öğr.Say.",null,null,null,"A.Sın.Yük.",null,null,null,"Hafta"]
[1,null,null,null,null,null,null,null,null,null,null,null,null,null,null,null,null,null,null,null,null,null,null,null,null,null,null,null,{"$f":"IF(F1form!T15=1,F1form!C15,\"\")","v":"BLP 157"},null,null,null,{"$f":"IF(F1form!T15=1,F1form!D15,\"\")","v":"Web Tasarımının Temelleri"},null,null,null,null,null,null,null,null,null,null,null,null,"2024-10-10",null,null,null,{"$f":"IF(F1form!T15=1,F1form!F15,0)","v":69},null,null,null,{"$f":"IF(AX36>100,3,IF(AX36>50,2,IF(AX36>0,1,0)))","v":2}]
[2,null,null,null,null,null,null,null,null,null,null,null,null,null,null,null,null,null,null,null,null,null,null,null,null,null,null,null,{"$f":"IF(F1form!T16=1,F1form!C16,\"\")","v":"BLP 215"},null,null,null,{"$f":"IF(F1form!T16=1,F1form!D16,\"\")","v":"Sensörler"},null,null,null,null,null,null,null,null,null,null,null,null,"2024-10-11",null,null,null,{"$f":"IF(F1form!T16=1,F1form!F16,0)","v":57},null,null,null,{"$f":"IF(AX37>100,3,IF(AX37>50,2,IF(AX37>0,1,0)))","v":2}]
[3,null,null,null,null,null,null,null,null,null,null,null,null,null,null,null,null,null,null,null,null,null,null,null,null,null,null,null,{"$f":"IF(F1form!T17=1,F1form!C17,\"\")","v":""},null,null,null,{"$f":"IF(F1form!T17=1,F1form!D17,\"\")","v":""},null,null,null,null,null,null,null,null,null,null,null,null,"2024-10-12",null,null,null,{"$f":"IF(F1form!T17=1,F1form!F17,0)","v":0},null,null,null,0]
[4,null,null,null,null,null,null,null,null,null,null,null,null,null,null,null,null,null,null,null,null,null,null,null,null,null,null,null,{"$f":"IF(F1form!T18=1,F1form!C18,\"\")","v":""},null,null,null,{"$f":"IF(F1form!T18=1,F1form!D18,\"\")","v":""},null,null,null,null,null,null,null,null,null,null,null,null,"2024-10-13",null,null,null,{"$f":"IF(F1form!T18=1,F1form!F18,0)","v":0},null,null,null,0]
[5,null,null,null,null,null,null,null,null,null,null,null,null,null,null,null,null,null,null,null,null,null,null,null,null,null,null,null,{"$f":"IF(F1form!T19=1,F1form!C19,\"\")","v":""},null,null,null,{"$f":"IF(F1form!T19=1,F1form!D19,\"\")","v":""},null,null,null,null,null,null,null,null,null,null,null,null,"2024-10-14",null,null,null,{"$f":"IF(F1form!T19=1,F1form!F19,0)","v":0},null,null,null,0]
[6,null,null,null,null,null,null,null,null,null,null,null,null,null,null,null,null,null,null,null,null,null,null,null,null,null,null,null,{"$f":"IF(F1form!T20=1,F1form!C20,\"\")","v":""},null,null,null,{"$f":"IF(F1form!T20=1,F1form!D20,\"\")","v":""},null,null,null,null,null,null,null,null,null,null,null,null,null,null,null,null,{"$f":"IF(F1form!T20=1,F1form!F20,0)","v":0},null,null,null,0]
[7,null,null,null,null,null,null,null,null,null,null,null,null,null,null,null,null,null,null,null,null,null,null,null,null,null,null,null,{"$f":"IF(F1form!T21=1,F1form!C21,\"\")","v":""},null,null,null,{"$f":"IF(F1form!T21=1,F1form!D21,\"\")","v":""},null,null,null,null,null,null,null,null,null,null,null,null,null,null,null,null,{"$f":"IF(F1form!T21=1,F1form!F21,0)","v":0},null,null,null,0]
[8,null,null,null,null,null,null,null,null,null,null,null,null,null,null,null,null,null,null,null,null,null,null,null,null,null,null,null,{"$f":"IF(F1form!T22=1,F1form!C22,\"\")","v":""},null,null,null,{"$f":"IF(F1form!T22=1,F1form!D22,\"\")","v":""},null,null,null,null,null,null,null,null,null,null,null,null,null,null,null,null,{"$f":"IF(F1form!T22=1,F1form!F22,0)","v":0},null,null,null,0]
[9,null,null,null,null,null,null,null,null,null,null,null,null,null,null,null,null,null,null,null,null,null,null,null,null,null,null,null,{"$f":"IF(F1form!T23=1,F1form!C23,\"\")","v":""},null,null,null,{"$f":"IF(F1form!T23=1,F1form!D23,\"\")","v":""},null,null,null,null,null,null,null,null,null,null,null,null,null,null,null,null,{"$f":"IF(F1form!T23=1,F1form!F23,0)","v":0},null,null,null,0]
[10,null,null,null,null,null,null,null,null,null,null,null,null,null,null,null,null,null,null,null,null,null,null,null,null,null,null,null,{"$f":"IF(F1form!T24=1,F1form!C24,\"\")","v":""},null,null,null,{"$f":"IF(F1form!T24=1,F1form!D24,\"\")","v":""},null,null,null,null,null,null,null,null,null,null,null,null,null,null,null,null,{"$f":"IF(F1form!T24=1,F1form!F24,0)","v":0},null,null,null,0]
[null,"TOPLAM",null,null,null,null,null,null,null,null,null,null,null,null,null,null,null,null,null,null,{"$f":"SUM(U36:V45)","v":0},null,{"$f":"SUM(W36:X45)","v":0},null,null,null,null,null,"TOPLAM",null,null,null,null,null,null,null,null,null,null,null,null,null,null,null,null,null,null,null,null,null,null,null,null,{"$f":"SUM(BB36:BE45)","v":4}]
[]
[]
[]
[null,null,null,null,null,null,null,null,null,null,null,null,null,null,null,null,"yapilmayan",null,null,null,"1.h","t","u","2.h","t","u","3.h","t","u","4.h","t","u","5.h","t","u",null,"Sinav yükü",null,null,null,null,"1.h",null,"u","2.h",null,"u","3.h",null,"u","4.h",null,"u","5.h","t","u"]
[null,null,null,null,null,null,null,null,null,null,null,null,null,null,null,null,null,null,null,null,"ders",null,null,null,null,null,null,null,null,null,null,null,null,null,null,null,null,null,null,null,null,"ders"]
[null,null,null,null,null,null,null,null,null,null,null,null,null,null,null,null,null,null,null,null,1,{"$f":"IF(Y36=1,U36,0)","v":0},{"$f":"IF(Y36=1,W36,0)","v":0},null,{"$f":"IF(Y36=2,U36,0)","v":0},{"$f":"IF(Y36=2,W36,0)","v":0},null,{"$f":"IF(Y36=3,U36,0)","v":0},{"$f":"IF(Y36=3,W36,0)","v":0},null,{"$f":"IF(Y36=4,U36,0)","v":0},{"$f":"IF(Y36=4,W36,0)","v":0},null,{"$f":"IF(Y36=5,U36,0)","v":0},{"$f":"IF(Y36=5,W36,0)","v":0},null,null,null,null,null,null,1,null,{"$f":"IF(BF36=1,BB36,0)","v":0},null,null,{"$f":"IF(BF36=2,BB36,0)","v":0},null,null,{"$f":"IF(BF36=3,BB36,0)","v":0},null,null,{"$f":"IF(BF36=4,BB36,0)","v":0},null,null,{"$f":"IF(BF36=5,BB36,0)","v":0}]
[null,null,null,null,null,null,null,null,null,null,null,null,null,null,null,null,null,null,null,null,2,0,{"$f":"IF(Y37=1,W37,0)","v":0},null,0,{"$f":"IF(Y37=2,W37,0)","v":0},null,0,0,null,0,0,null,0,0,null,null,null,null,null,null,2,null,{"$f":"IF(BF37=1,BB37,0)","v":0},null,null,{"$f":"IF(BF37=2,BB37,0)","v":0},null,null,{"$f":"IF(BF37=3,BB37,0)","v":0},null,null,{"$f":"IF(BF37=4,BB37,0)","v":0},null,null,{"$f":"IF(BF37=5,BB37,0)","v":0}]
[null,null,null,null,null,null,null,null,null,null,null,null,null,null,null,null,null,null,null,null,3,0,0,null,0,0,null,0,0,null,0,0,null,0,0,null,null,null,null,null,null,3,null,0,null,null,0,null,null,0,null,null,0,null,null,0]
[null,null,null,null,null,null,null,null,null,null,null,null,null,null,null,null,null,null,null,null,4,0,0,null,0,0,null,0,0,null,0,0,null,0,0,null,null,null,null,null,null,4,null,0,null,null,0,null,null,0,null,null,0,null,null,0]
[null,null,null,null,null,null,null,null,null,null,null,null,null,null,null,null,null,null,null,null,5,0,0,null,0,0,null,0,0,null,0,0,null,0,0,null,null,null,null,null,null,5,null,0,null,null,0,null,null,0,null,null,0,null,null,0]
[null,null,null,null,null,null,null,null,null,null,null,null,null,null,null,null,null,null,null,null,6,0,0,null,0,0,null,0,0,null,0,0,null,0,0,null,null,null,null,null,null,6,null,0,null,null,0,null,null,0,null,null,0,null,null,0]
[null,null,null,null,null,null,null,null,null,null,null,null,null,null,null,null,null,null,null,null,7,0,0,null,0,0,null,0,0,null,0,0,null,0,0,null,null,null,null,null,null,7,null,0,null,null,0,null,null,0,null,null,0,null,null,0]
[null,null,null,null,null,null,null,null,null,null,null,null,null,null,null,null,null,null,null,null,8,0,0,null,0,0,null,0,0,null,0,0,null,0,0,null,null,null,null,null,null,8,null,0,null,null,0,null,null,0,null,null,0,null,null,0]
[null,null,null,null,null,null,null,null,null,null,null,null,null,null,null,null,null,null,null,null,9,0,0,null,0,0,null,0,0,null,0,0,null,0,0,null,null,null,null,null,null,9,null,0,null,null,0,null,null,0,null,null,0,null,null,0]
[null,null,null,null,null,null,null,null,null,null,null,null,null,null,null,null,null,null,null,null,10,0,0,null,0,0,null,0,0,null,0,0,null,0,0,null,null,null,null,null,null,10,null,{"$f":"IF(BF45=1,BB45,0)","v":0},null,null,{"$f":"IF(BF45=2,BB45,0)","v":0},null,null,{"$f":"IF(BF45=3,BB45,0)","v":0},null,null,{"$f":"IF(BF45=4,BB45,0)","v":0},null,null,{"$f":"IF(BF45=5,BB45,0)","v":0}]
[null,null,null,null,null,null,null,null,null,null,null,null,null,null,null,null,null,null,null,null,null,{"$f":"SUM(V52:V61)","v":0},{"$f":"SUM(W52:W61)","v":0},null,0,0,null,0,0,null,0,0,null,{"$f":"SUM(AH52:AH61)","v":0},{"$f":"SUM(AI52:AI61)","v":0},null,null,null,null,null,null,null,null,{"$f":"SUM(AR52:AR61)","v":0},null,null,{"$f":"SUM(AU52:AU61)","v":0},null,null,{"$f":"SUM(AX52:AX61)","v":0},null,null,{"$f":"SUM(BA52:BA61)","v":0},null,null,{"$f":"SUM(BD52:BD61)","v":0}]

{"sheet":"NorForm","index":4,"n_rows":78,"n_cols":83,"rows_kept":78,"cut":false,"hidden":false,"merged":[[71,23,71,29],[73,0,73,1],[72,0,72,1],[72,3,72,7],[71,14,71,16],[71,18,71,19],[74,0,74,1],[71,0,71,1],[71,2,71,13],[71,20,71,22],[43,0,43,4],[49,22,49,24],[46,19,46,21],[46,22,46,24],[45,22,45,24],[42,22,42,24],[44,19,44,21],[42,19,42,21],[41,0,41,4],[42,0,42,4],[45,0,45,4],[46,5,46,18],[46,0,46,4],[45,5,45,18],[41,5,41,18],[44,0,44,4],[42,5,42,18],[44,5,44,18],[41,19,41,21],[43,19,43,21],[44,22,44,24],[43,5,43,18],[47,22,47,24],[47,19,47,21],[77,1,77,14],[71,33,71,37],[77,19,77,35],[69,20,69,22],[69,23,69,26],[69,14,69,16],[69,17,69,19],[40,33,40,40],[41,22,41,24],[50,25,50,30],[61,17,61,21],[62,26,62,30],[65,22,65,25],[64,22,64,25],[63,22,63,25],[55,17,55,21],[43,22,43,24],[49,25,49,30],[66,0,66,25],[48,0,48,4],[63,26,63,30],[47,0,47,4],[71,39,71,60],[76,44,76,60],[44,33,44,40],[39,47,43,53],[42,33,42,40],[40,25,40,30],[45,25,45,30],[46,25,46,30],[44,25,44,30],[39,44,39,46],[41,44,41,46],[42,25,42,30],[41,25,41,30],[44,47,44,53],[41,41,41,43],[40,44,40,46],[43,25,43,30],[39,33,39,40],[45,33,45,40],[49,41,49,43],[30,55,30,57],[50,54,50,61],[51,54,55,61],[50,41,50,46],[53,41,53,43],[44,54,44,61],[45,47,49,53],[50,47,50,53],[40,41,40,43],[30,58,30,61],[36,58,36,61],[33,58,33,61],[42,44,42,46],[45,54,49,61],[48,41,48,43],[47,41,47,43],[47,44,47,46],[48,44,48,46],[33,36,33,54],[32,58,32,61],[32,55,32,57],[49,44,49,46],[50,33,50,40],[76,19,76,31],[22,14,22,15],[22,16,22,17],[71,30,71,31],[22,36,22,37],[22,48,22,49],[30,36,30,54],[31,36,31,54],[35,31,35,35],[32,36,32,54],[33,31,33,35],[32,31,32,35],[22,40,22,41],[22,42,22,43],[46,44,46,46],[46,41,46,43],[44,41,44,46],[46,33,46,40],[39,41,39,43],[43,33,43,40],[43,41,43,43],[62,41,62,46],[58,41,58,43],[63,41,63,43],[2,60,2,61],[2,34,2,44],[6,0,6,9],[6,16,6,21],[6,58,6,61],[2,52,2,53],[2,8,2,27],[2,28,2,33],[2,0,2,7],[6,22,6,27],[3,45,3,48],[3,34,3,44],[3,28,3,33],[3,8,3,27],[6,10,6,15],[6,28,6,33],[6,34,6,39],[3,56,3,61],[3,49,3,54],[5,0,5,61],[6,46,6,51],[12,40,12,45],[0,0,0,29],[1,0,1,61],[2,54,2,59],[2,45,2,51],[0,30,0,61],[3,0,3,7],[8,22,8,27],[7,34,7,39],[9,28,9,33],[9,22,9,27],[8,28,8,33],[7,28,7,33],[8,34,8,39],[9,34,9,39],[6,40,6,45],[8,40,8,45],[8,52,8,57],[8,46,8,51],[7,46,7,51],[7,40,7,45],[7,52,7,57],[8,58,8,61],[6,52,6,57],[7,58,7,61],[12,58,12,61],[12,46,12,51],[11,46,11,51],[21,30,21,31],[21,28,21,29],[10,28,10,33],[21,6,21,7],[9,16,9,21],[10,16,10,21],[10,22,10,27],[9,52,9,57],[9,46,9,51],[9,58,9,61],[10,58,10,61],[10,46,10,51],[14,46,14,51],[11,34,11,39],[12,6,12,9],[20,20,20,21],[21,20,21,21],[20,18,20,19],[21,16,21,17],[13,6,13,9],[10,34,10,39],[20,42,20,43],[20,46,20,47],[11,52,11,57],[12,52,12,57],[21,54,21,61],[18,36,18,61],[11,40,11,45],[14,58,14,61],[13,58,13,61],[12,34,12,39],[20,40,20,41],[15,34,15,39],[13,46,13,51],[16,46,16,51],[15,46,15,51],[19,44,19,53],[11,58,11,61],[10,52,10,57],[10,40,10,45],[13,40,13,45],[15,40,15,45],[16,40,16,45],[21,52,21,53],[16,52,16,57],[16,58,16,61],[27,36,27,54],[28,36,28,54],[25,31,25,35],[25,27,25,29],[22,38,22,39],[22,28,22,29],[22,44,22,45],[22,26,22,27],[22,34,22,35],[22,50,22,51],[27,55,27,57],[26,31,26,35],[27,31,27,35],[26,36,26,54],[28,31,28,35],[22,52,22,53],[28,55,28,57],[21,48,21,49],[21,46,21,47],[21,50,21,51],[20,48,20,49],[26,55,26,57],[14,34,14,39],[14,52,14,57],[21,38,21,39],[16,34,16,39],[25,36,25,54],[25,24,25,26],[20,50,20,51],[15,28,15,33],[21,44,21,45],[17,0,17,61],[22,6,22,7],[22,0,22,3],[21,0,21,3],[19,24,19,33],[20,34,20,35],[21,34,21,35],[20,30,20,31],[24,31,24,61],[21,40,21,41],[22,30,22,31],[19,34,19,43],[22,54,22,61],[19,4,19,13],[22,32,22,33],[26,24,26,26],[22,18,22,19],[28,27,28,29],[20,44,20,45],[20,28,20,29],[19,54,20,61],[20,52,20,53],[29,31,29,35],[20,8,20,9],[21,18,21,19],[21,14,21,15],[21,12,21,13],[20,32,20,33],[21,32,21,33],[22,46,22,47],[20,36,20,37],[29,5,29,23],[21,4,21,5],[20,10,20,11],[22,8,22,9],[21,22,21,23],[22,24,22,25],[40,5,40,18],[37,0,37,61],[42,41,42,43],[21,42,21,43],[21,36,21,37],[27,58,27,61],[28,58,28,61],[29,58,29,61],[36,55,36,57],[34,55,34,57],[34,58,34,61],[33,0,33,4],[34,5,34,23],[40,19,40,21],[39,0,39,18],[33,5,33,23],[38,0,38,30],[34,0,34,4],[40,0,40,4],[35,5,35,23],[32,0,32,4],[26,58,26,61],[32,5,32,23],[29,55,29,57],[39,19,39,21],[26,0,26,4],[25,5,25,23],[36,24,36,26],[36,27,36,29],[36,31,36,54],[30,0,30,4],[30,31,30,35],[31,31,31,35],[39,54,43,61],[33,55,33,57],[34,36,34,54],[38,33,38,61],[35,58,35,61],[35,55,35,57],[34,31,34,35],[43,44,43,46],[41,33,41,40],[26,5,26,23],[27,5,27,23],[26,27,26,29],[24,30,36,30],[29,36,29,54],[35,0,35,4],[58,22,58,25],[50,19,50,21],[50,0,50,18],[50,22,50,24],[49,19,49,21],[49,0,49,4],[40,22,40,24],[36,0,36,23],[25,58,25,61],[25,55,25,57],[34,27,34,29],[31,0,31,4],[31,5,31,23],[30,5,30,23],[32,24,32,26],[31,58,31,61],[39,22,39,24],[39,25,39,30],[34,24,34,26],[31,55,31,57],[31,24,31,26],[29,27,29,29],[33,24,33,26],[33,27,33,29],[9,40,9,45],[14,40,14,45],[15,58,15,61],[15,22,15,27],[15,16,15,21],[13,52,13,57],[15,52,15,57],[31,27,31,29],[27,24,27,26],[27,27,27,29],[13,16,13,21],[18,0,18,19],[20,16,20,17],[13,28,13,33],[30,24,30,26],[18,29,18,35],[29,24,29,26],[14,28,14,33],[16,28,16,33],[20,22,20,23],[19,14,19,23],[29,0,29,4],[15,0,16,5],[15,6,15,9],[11,0,12,5],[9,0,10,5],[9,6,9,9],[19,0,19,3],[24,0,24,29],[16,10,16,15],[10,10,10,15],[22,10,22,11],[20,24,20,25],[20,26,20,27],[11,28,11,33],[12,28,12,33],[12,10,12,15],[12,16,12,21],[12,22,12,27],[20,0,20,3],[22,4,22,5],[22,20,22,21],[22,22,22,23],[13,0,14,5],[20,6,20,7],[21,10,21,11],[8,6,8,9],[10,6,10,9],[8,10,8,15],[9,10,9,15],[16,6,16,9],[15,10,15,15],[28,0,28,4],[20,12,20,13],[20,4,20,5],[27,0,27,4],[20,14,20,15],[28,5,28,23],[25,0,25,4],[13,10,13,15],[14,10,14,15],[11,6,11,9],[11,16,11,21],[11,22,11,27],[11,10,11,15],[22,12,22,13],[7,0,8,5],[28,24,28,26],[7,10,7,15],[7,22,7,27],[60,41,60,43],[65,17,65,21],[65,0,65,3],[65,4,65,16],[13,34,13,39],[8,16,8,21],[7,16,7,21],[7,6,7,9],[35,27,35,29],[35,36,35,54],[35,24,35,26],[14,6,14,9],[18,20,18,27],[14,16,14,21],[32,27,32,29],[14,22,14,27],[16,16,16,21],[21,8,21,9],[16,22,16,27],[21,24,21,25],[21,26,21,27],[30,27,30,29],[13,22,13,27],[20,38,20,39],[54,33,54,40],[66,26,66,30],[60,26,60,30],[61,26,61,30],[70,0,70,61],[67,33,67,40],[67,41,67,43],[67,44,67,46],[62,33,62,40],[69,57,69,61],[66,41,66,43],[62,47,62,53],[65,44,65,46],[64,44,64,46],[68,41,68,46],[69,33,69,56],[68,33,68,40],[68,47,68,53],[63,54,67,61],[64,4,64,16],[62,17,62,21],[64,0,64,3],[63,17,63,21],[65,41,65,43],[77,44,77,60],[68,54,68,61],[51,44,51,46],[51,41,51,43],[53,44,53,46],[62,54,62,61],[57,47,61,53],[55,44,55,46],[63,47,67,53],[57,54,61,61],[56,54,56,61],[61,44,61,46],[56,47,56,53],[58,44,58,46],[51,47,55,53],[63,44,63,46],[52,41,52,43],[52,44,52,46],[54,44,54,46],[61,41,61,43],[59,41,59,43],[59,44,59,46],[60,44,60,46],[66,44,66,46],[57,44,57,46],[64,33,64,40],[65,33,65,40],[66,33,66,40],[65,26,65,30],[48,33,48,40],[49,33,49,40],[61,33,61,40],[38,31,69,32],[64,26,64,30],[64,41,64,43],[45,41,45,43],[63,33,63,40],[60,33,60,40],[55,33,55,40],[55,41,55,43],[54,41,54,43],[53,33,53,40],[52,33,52,40],[56,41,56,46],[45,44,45,46],[51,33,51,40],[59,33,59,40],[47,33,47,40],[64,17,64,21],[58,4,58,16],[62,4,62,16],[57,4,57,16],[57,17,57,21],[62,0,62,3],[56,4,56,16],[57,41,57,43],[58,33,58,40],[57,26,57,30],[57,0,57,3],[59,17,59,21],[60,17,60,21],[58,17,58,21],[56,17,56,21],[56,0,56,3],[59,22,59,25],[56,22,56,25],[56,33,56,40],[57,33,57,40],[58,26,58,30],[56,26,56,30],[60,0,60,3],[60,4,60,16],[62,22,62,25],[61,22,61,25],[61,0,61,3],[61,4,61,16],[58,0,58,3],[45,19,45,21],[49,5,49,18],[63,0,63,3],[63,4,63,16],[47,5,47,18],[47,25,47,30],[55,22,55,25],[53,0,53,30],[55,0,55,16],[54,0,54,30],[59,0,59,3],[59,4,59,16],[59,26,59,30],[60,22,60,25],[48,19,48,21],[48,22,48,24],[48,5,48,18],[48,25,48,30],[57,22,57,25]]}
["AYLIK DERS YÜKLERİ BİLDİRİM FORMU",null,null,null,null,null,null,null,null,null,null,null,null,null,null,null,null,null,null,null,null,null,null,null,null,null,null,null,null,null,"NORMAL ÖĞRETİM"]
["Çizelge 1- Genel Bilgiler"]
["Ünv.Adı Soyadı",null,null,null,null,null,null,null,{"$f":"NorGiris!I5","v":"Öğr.Gör. Celalettin AYDIN"},null,null,null,null,null,null,null,null,null,null,null,null,null,null,null,null,null,null,null,"Bölümü",null,null,null,null,null,{"$f":"NorGiris!AK4","v":"Bilgisayar Bölümü"},null,null,null,null,null,null,null,null,null,null,"Zor.Der.Yükü",null,null,null,null,null,null,{"$f":"NorGiris!AN3","v":4},null,"Hafta Sayısı",null,null,null,null,null,{"$f":"NorGiris!I4","v":1}]
["Fakülte -Yük.Ok.",null,null,null,null,null,null,null,{"$f":"NorGiris!I2","v":"Ç.Ü. CEyhan Meslek Yüksekokulu"},null,null,null,null,null,null,null,null,null,null,null,null,null,null,null,null,null,null,null,"İdari Görevi",null,null,null,null,null,{"$f":"NorGiris!AN2","v":0},null,null,null,null,null,null,null,null,null,null,"Dönem ",null,null,null,{"$f":"NorGiris!I3","v":"2025-09-27"},null,null,null,null,null,"-",{"$f":"NorGiris!O3","v":"2025-10-01"}]
[]
["Çizelge 2- Haftalık Ders Programı"]
["Günler",null,null,null,null,null,null,null,null,null,{"$f":"NorGiris!I8","v":"08:30-09:15"},null,null,null,null,null,{"$f":"NorGiris!N8","v":"09:30-10:15"},null,null,null,null,null,{"$f":"NorGiris!S8","v":"10:30-11:15"},null,null,null,null,null,{"$f":"NorGiris!X8","v":"11:30-12:15"},null,null,null,null,null,{"$f":"NorGiris!AC8","v":"13:00-13:45"},null,null,null,null,null,{"$f":"NorGiris!AH8","v":"14:00-14:45"},null,null,null,null,null,{"$f":"NorGiris!AM8","v":"15:00-15:45"},null,null,null,null,null,{"$f":"NorGiris!AR8","v":"16:00-16:45"},null,null,null,null,null,"Toplam",null,null,null,null,null,1,2,3,4,5,6,7,8,9]
["Pazartesi",null,null,null,null,null,"Teorik",null,null,null,{"$f":"NorGiris!I9","v":0},null,null,null,null,null,{"$f":"NorGiris!N9","v":0},null,null,null,null,null,{"$f":"NorGiris!S9","v":0},null,null,null,null,null,{"$f":"NorGiris!X9","v":0},null,null,null,null,null,{"$f":"NorGiris!AC9","v":0},null,null,null,null,null,{"$f":"NorGiris!AH9","v":0},null,null,null,null,null,{"$f":"NorGiris!AM9","v":0},null,null,null,null,null,{"$f":"NorGiris!AR9","v":0},null,null,null,null,null,{"$f":"BV8","v":0},null,null,null,null,null,{"$f":"IF(K8<>0,1,0)","v":0},{"$f":"IF(Q8<>0,1,0)","v":0},{"$f":"IF(W8<>0,1,0)","v":0},{"$f":"IF(AC8<>0,1,0)","v":0},{"$f":"IF(AI8<>0,1,0)","v":0},{"$f":"IF(AO8<>0,1,0)","v":0},{"$f":"IF(AU8<>0,1,0)","v":0},{"$f":"IF(BA8<>0,1,0)","v":0},null,{"$f":"SUM(BM8:BU8)","v":0}]
[null,null,null,null,null,null,"Diğer f.",null,null,null,{"$f":"NorGiris!I10","v":0},null,null,null,null,null,{"$f":"NorGiris!N10","v":0},null,null,null,null,null,{"$f":"NorGiris!S10","v":0},null,null,null,null,null,{"$f":"NorGiris!X10","v":0},null,null,null,null,null,{"$f":"NorGiris!AC10","v":0},null,null,null,null,null,{"$f":"NorGiris!AH10","v":0},null,null,null,null,null,{"$f":"NorGiris!AM10","v":0},null,null,null,null,null,{"$f":"NorGiris!AR10","v":0},null,null,null,null,null,0,null,null,null,null,null,0,0,0,0,0,0,0,0,null,{"$f":"SUM(BM9:BU9)","v":0}]
["Salı",null,null,null,null,null,"Teorik",null,null,null,{"$f":"NorGiris!I11","v":0},null,null,null,null,null,{"$f":"NorGiris!N11","v":0},null,null,null,null,null,{"$f":"NorGiris!S11","v":0},null,null,null,null,null,{"$f":"NorGiris!X11","v":0},null,null,null,null,null,{"$f":"NorGiris!AC11","v":0},null,null,null,null,null,{"$f":"NorGiris!AH11","v":0},null,null,null,null,null,{"$f":"NorGiris!AM11","v":0},null,null,null,null,null,{"$f":"NorGiris!AR11","v":0},null,null,null,null,null,0,null,null,null,null,null,0,0,0,0,0,0,0,0,null,{"$f":"SUM(BM10:BU10)","v":0}]
[null,null,null,null,null,null,"Diğer f.",null,null,null,{"$f":"NorGiris!I12","v":0},null,null,null,null,null,{"$f":"NorGiris!N12","v":0},null,null,null,null,null,{"$f":"NorGiris!S12","v":0},null,null,null,null,null,{"$f":"NorGiris!X12","v":0},null,null,null,null,null,{"$f":"NorGiris!AC12","v":0},null,null,null,null,null,{"$f":"NorGiris!AH12","v":0},null,null,null,null,null,{"$f":"NorGiris!AM12","v":0},null,null,null,null,null,{"$f":"NorGiris!AR12","v":0},null,null,null,null,null,0,null,null,null,null,null,0,0,0,0,0,0,0,0,null,0]
["Çarşamba",null,null,null,null,null,"Teorik",null,null,null,{"$f":"NorGiris!I13","v":0},null,null,null,null,null,{"$f":"NorGiris!N13","v":0},null,null,null,null,null,{"$f":"NorGiris!S13","v":0},null,null,null,null,null,{"$f":"NorGiris!X13","v":0},null,null,null,null,null,{"$f":"NorGiris!AC13","v":0},null,null,null,null,null,{"$f":"NorGiris!AH13","v":0},null,null,null,null,null,{"$f":"NorGiris!AM13","v":0},null,null,null,null,null,{"$f":"NorGiris!AR13","v":0},null,null,null,null,null,0,null,null,null,null,null,0,0,0,0,0,0,0,0,null,0]
[null,null,null,null,null,null,"Diğer f.",null,null,null,{"$f":"NorGiris!I14","v":0},null,null,null,null,null,{"$f":"NorGiris!N14","v":0},null,null,null,null,null,{"$f":"NorGiris!S14","v":0},null,null,null,null,null,{"$f":"NorGiris!X14","v":0},null,null,null,null,null,{"$f":"NorGiris!AC14","v":0},null,null,null,null,null,{"$f":"NorGiris!AH14","v":0},null,null,null,null,null,{"$f":"NorGiris!AM14","v":0},null,null,null,null,null,{"$f":"NorGiris!AR14","v":0},null,null,null,null,null,0,null,null,null,null,null,0,0,0,0,0,0,0,0,null,0]
["Perşembe",null,null,null,null,null,"Teorik",null,null,null,{"$f":"NorGiris!I15","v":0},null,null,null,null,null,{"$f":"NorGiris!N15","v":0},null,null,null,null,null,{"$f":"NorGiris!S15","v":0},null,null,null,null,null,{"$f":"NorGiris!X15","v":0},null,null,null,null,null,{"$f":"NorGiris!AC15","v":0},null,null,null,null,null,{"$f":"NorGiris!AH15","v":0},null,null,null,null,null,{"$f":"NorGiris!AM15","v":0},null,null,null,null,null,{"$f":"NorGiris!AR15","v":0},null,null,null,null,null,0,null,null,null,null,null,0,0,0,0,0,0,0,0,null,0]
[null,null,null,null,null,null,"Diğer f.",null,null,null,{"$f":"NorGiris!I16","v":0},null,null,null,null,null,{"$f":"NorGiris!N16","v":0},null,null,null,null,null,{"$f":"NorGiris!S16","v":0},null,null,null,null,null,{"$f":"NorGiris!X16","v":0},null,null,null,null,null,{"$f":"NorGiris!AC16","v":0},null,null,null,null,null,{"$f":"NorGiris!AH16","v":0},null,null,null,null,null,{"$f":"NorGiris!AM16","v":0},null,null,null,null,null,{"$f":"NorGiris!AR16","v":0},null,null,null,null,null,0,null,null,null,null,null,0,0,0,0,0,0,0,0,null,0]
["Cuma",null,null,null,null,null,"Teorik",null,null,null,{"$f":"NorGiris!I17","v":0},null,null,null,null,null,{"$f":"NorGiris!N17","v":0},null,null,null,null,null,{"$f":"NorGiris!S17","v":"BLP 157"},null,null,null,null,null,{"$f":"NorGiris!X17","v":"BLP 157"},null,null,null,null,null,{"$f":"NorGiris!AC17","v":"BLP 215"},null,null,null,null,null,{"$f":"NorGiris!AH17","v":"BLP 215"},null,null,null,null,null,{"$f":"NorGiris!AM17","v":0},null,null,null,null,null,{"$f":"NorGiris!AR17","v":0},null,null,null,null,null,4,null,null,null,null,null,0,0,1,1,1,1,0,0,null,4]
[null,null,null,null,null,null,"Diğer f.",null,null,null,{"$f":"NorGiris!I18","v":0},null,null,null,null,null,{"$f":"NorGiris!N18","v":0},null,null,null,null,null,{"$f":"NorGiris!S18","v":0},null,null,null,null,null,{"$f":"NorGiris!X18","v":0},null,null,null,null,null,{"$f":"NorGiris!AC18","v":0},null,null,null,null,null,{"$f":"NorGiris!AH18","v":0},null,null,null,null,null,{"$f":"NorGiris!AM18","v":0},null,null,null,null,null,{"$f":"NorGiris!AR18","v":0},null,null,null,null,null,0,null,null,null,null,null,0,0,0,0,0,0,0,0,null,0]
[]
["Çizelge 3 Aylık Ders Saati Dağılımı",null,null,null,null,null,null,null,null,null,null,null,null,null,null,null,null,null,null,null,{"$f":"AX4","v":"2025-09-27"},null,null,null,null,null,null,null,"-",{"$f":"BE4","v":"2025-10-01"}]
[null,null,null,null,"1. HAFTA",null,null,null,null,null,null,null,null,null,"2. HAFTA",null,null,null,null,null,null,null,null,null,"3. HAFTA",null,null,null,null,null,null,null,null,null,"4. HAFTA",null,null,null,null,null,null,null,null,null,"5. HAFTA",null,null,null,null,null,null,null,null,null,"TOPLAM"]
["Günler",null,null,null,{"$f":"AX4","v":"2025-09-27"},null,{"$f":"E21+1","v":"2025-09-28"},null,{"$f":"G21+1","v":"2025-09-29"},null,{"$f":"I21+1","v":"2025-09-30"},null,{"$f":"K21+1","v":"2025-10-01"},null,{"$f":"M21+3","v":"2025-10-04"},null,{"$f":"O21+1","v":"2025-10-05"},null,{"$f":"Q21+1","v":"2025-10-06"},null,{"$f":"S21+1","v":"2025-10-07"},null,{"$f":"U21+1","v":"2025-10-08"},null,{"$f":"W21+3","v":"2025-10-11"},null,{"$f":"Y21+1","v":"2025-10-12"},null,{"$f":"AA21+1","v":"2025-10-13"},null,{"$f":"AC21+1","v":"2025-10-14"},null,{"$f":"AE21+1","v":"2025-10-15"},null,{"$f":"AG21+3","v":"2025-10-18"},null,{"$f":"AI21+1","v":"2025-10-19"},null,{"$f":"AK21+1","v":"2025-10-20"},null,{"$f":"AM21+1","v":"2025-10-21"},null,{"$f":"AO21+1","v":"2025-10-22"},null,{"$f":"AQ21+3","v":"2025-10-25"},null,{"$f":"AS21+1","v":"2025-10-26"},null,{"$f":"AU21+1","v":"2025-10-27"},null,{"$f":"AW21+1","v":"2025-10-28"},null,{"$f":"AY21+1","v":"2025-10-29"}]
["Teorik",null,null,null,{"$f":"BG8","v":0},null,{"$f":"BG10","v":0},null,{"$f":"BG12","v":0},null,{"$f":"BG14","v":0},null,{"$f":"BG16","v":4},null,{"$f":"IF($BI$3>=2,E22,0)","v":0},null,{"$f":"IF($BI$3>=2,G22,0)","v":0},null,{"$f":"IF($BI$3>=2,I22,0)","v":0},null,{"$f":"IF($BI$3>=2,K22,0)","v":0},null,{"$f":"IF($BI$3>=2,M22,0)","v":0},null,{"$f":"IF($BI$3>=3,O22,0)","v":0},null,{"$f":"IF($BI$3>=3,Q22,0)","v":0},null,{"$f":"IF($BI$3>=3,S22,0)","v":0},null,{"$f":"IF($BI$3>=3,U22,0)","v":0},null,{"$f":"IF($BI$3>=3,W22,0)","v":0},null,{"$f":"IF($BI$3>=4,Y22,0)","v":0},null,{"$f":"IF($BI$3>=4,AA22,0)","v":0},null,{"$f":"IF($BI$3>=4,AC22,0)","v":0},null,{"$f":"IF($BI$3>=4,AE22,0)","v":0},null,{"$f":"IF($BI$3>=4,AG22,0)","v":0},null,{"$f":"IF($BI$3>=5,AI22,0)","v":0},null,{"$f":"IF($BI$3>=5,AK22,0)","v":0},null,{"$f":"IF($BI$3>=5,AM22,0)","v":0},null,{"$f":"IF($BI$3>=5,AO22,0)","v":0},null,{"$f":"IF($BI$3>=5,AQ22,0)","v":0},null,{"$f":"SUM(E22:BB22)","v":4}]
["Diğer",null,null,null,{"$f":"BG9","v":0},null,{"$f":"BG11","v":0},null,{"$f":"BG13","v":0},null,{"$f":"BG15","v":0},null,{"$f":"BG17","v":0},null,{"$f":"IF($BI$3>=2,E23,0)","v":0},null,{"$f":"IF($BI$3>=2,G23,0)","v":0},null,{"$f":"IF($BI$3>=2,I23,0)","v":0},null,{"$f":"IF($BI$3>=2,K23,0)","v":0},null,{"$f":"IF($BI$3>=2,M23,0)","v":0},null,{"$f":"IF($BI$3>=3,O23,0)","v":0},null,{"$f":"IF($BI$3>=3,Q23,0)","v":0},null,{"$f":"IF($BI$3>=3,S23,0)","v":0},null,{"$f":"IF($BI$3>=3,U23,0)","v":0},null,{"$f":"IF($BI$3>=3,W23,0)","v":0},null,{"$f":"IF($BI$3>=4,Y23,0)","v":0},null,{"$f":"IF($BI$3>=4,AA23,0)","v":0},null,{"$f":"IF($BI$3>=4,AC23,0)","v":0},null,{"$f":"IF($BI$3>=4,AE23,0)","v":0},null,{"$f":"IF($BI$3>=4,AG23,0)","v":0},null,{"$f":"IF($BI$3>=5,AI23,0)","v":0},null,{"$f":"IF($BI$3>=5,AK23,0)","v":0},null,{"$f":"IF($BI$3>=5,AM23,0)","v":0},null,{"$f":"IF($BI$3>=5,AO23,0)","v":0},null,{"$f":"IF($BI$3>=5,AQ23,0)","v":0},null,{"$f":"SUM(E23:BB23)","v":0}]
[]
["Çizelge 4- Ders Yükleri",null,null,null,null,null,null,null,null,null,null,null,null,null,null,null,null,null,null,null,null,null,null,null,null,null,null,null,null,null,null,"Çizlge 5- Diğer Fakülte ve Yüksekokullarda"]
["Der.Kodu",null,null,null,null,"Dersin Adı",null,null,null,null,null,null,null,null,null,null,null,null,null,null,null,null,null,null,"Teo.",null,null,"Diğ.",null,null,null,"Der.Kodu",null,null,null,null,"Dersin Adı",null,null,null,null,null,null,null,null,null,null,null,null,null,null,null,null,null,null,"Teo.",null,null,"Diğ."]
[{"$f":"NorGiris!B22","v":"BLP 157"},null,null,null,null,{"$f":"NorGiris!F22","v":"Web Tasarımının Temelleri"},null,null,null,null,null,null,null,null,null,null,null,null,null,null,null,null,null,null,{"$f":"NorGiris!U22","v":2},null,null,{"$f":"NorGiris!W22","v":0},null,null,null,{"$f":"F1form!C60","v":0},null,null,null,null,{"$f":"F1form!D60","v":0},null,null,null,null,null,null,null,null,null,null,null,null,null,null,null,null,null,null,{"$f":"F1form!E60","v":0},null,null,{"$f":"F1form!F60","v":0}]
[{"$f":"NorGiris!B23","v":"BLP 215"},null,null,null,null,{"$f":"NorGiris!F23","v":"Sensörler"},null,null,null,null,null,null,null,null,null,null,null,null,null,null,null,null,null,null,{"$f":"NorGiris!U23","v":2},null,null,{"$f":"NorGiris!W23","v":0},null,null,null,{"$f":"F1form!C61","v":0},null,null,null,null,{"$f":"F1form!D61","v":0},null,null,null,null,null,null,null,null,null,null,null,null,null,null,null,null,null,null,{"$f":"F1form!E61","v":0},null,null,{"$f":"F1form!F61","v":0}]
[{"$f":"NorGiris!B24","v":""},null,null,null,null,{"$f":"NorGiris!F24","v":""},null,null,null,null,null,null,null,null,null,null,null,null,null,null,null,null,null,null,{"$f":"NorGiris!U24","v":""},null,null,{"$f":"NorGiris!W24","v":""},null,null,null,{"$f":"F1form!C62","v":0},null,null,null,null,{"$f":"F1form!D62","v":0},null,null,null,null,null,null,null,null,null,null,null,null,null,null,null,null,null,null,{"$f":"F1form!E62","v":0},null,null,{"$f":"F1form!F62","v":0}]
[{"$f":"NorGiris!B25","v":""},null,null,null,null,{"$f":"NorGiris!F25","v":""},null,null,null,null,null,null,null,null,null,null,null,null,null,null,null,null,null,null,{"$f":"NorGiris!U25","v":""},null,null,{"$f":"NorGiris!W25","v":""},null,null,null,{"$f":"F1form!C63","v":0},null,null,null,null,{"$f":"F1form!D63","v":0},null,null,null,null,null,null,null,null,null,null,null,null,null,null,null,null,null,null,{"$f":"F1form!E63","v":0},null,null,{"$f":"F1form!F63","v":0}]
[{"$f":"NorGiris!B26","v":""},null,null,null,null,{"$f":"NorGiris!F26","v":""},null,null,null,null,null,null,null,null,null,null,null,null,null,null,null,null,null,null,{"$f":"NorGiris!U26","v":""},null,null,{"$f":"NorGiris!W26","v":""},null,null,null,{"$f":"F1form!C64","v":0},null,null,null,null,{"$f":"F1form!D64","v":0},null,null,null,null,null,null,null,null,null,null,null,null,null,null,null,null,null,null,{"$f":"F1form!E64","v":0},null,null,{"$f":"F1form!F64","v":0}]
[{"$f":"NorGiris!B27","v":""},null,null,null,null,{"$f":"NorGiris!F27","v":""},null,null,null,null,null,null,null,null,null,null,null,null,null,null,null,null,null,null,{"$f":"NorGiris!U27","v":""},null,null,{"$f":"NorGiris!W27","v":""},null,null,null,{"$f":"F1form!C65","v":0},null,null,null,null,{"$f":"F1form!D65","v":0},null,null,null,null,null,null,null,null,null,null,null,null,null,null,null,null,null,null,{"$f":"F1form!E65","v":0},null,null,{"$f":"F1form!F65","v":0}]
[{"$f":"NorGiris!B28","v":""},null,null,null,null,{"$f":"NorGiris!F28","v":""},null,null,null,null,null,null,null,null,null,null,null,null,null,null,null,null,null,null,{"$f":"NorGiris!U28","v":""},null,null,{"$f":"NorGiris!W28","v":""},null,null,null,{"$f":"F1form!C66","v":0},null,null,null,null,{"$f":"F1form!D66","v":0},null,null,null,null,null,null,null,null,null,null,null,null,null,null,null,null,null,null,{"$f":"F1form!E66","v":0},null,null,{"$f":"F1form!F66","v":0}]
[{"$f":"NorGiris!B29","v":""},null,null,null,null,{"$f":"NorGiris!F29","v":""},null,null,null,null,null,null,null,null,null,null,null,null,null,null,null,null,null,null,{"$f":"NorGiris!U29","v":""},null,null,{"$f":"NorGiris!W29","v":""},null,null,null,{"$f":"F1form!C67","v":0},null,null,null,null,{"$f":"F1form!D67","v":0},null,null,null,null,null,null,null,null,null,null,null,null,null,null,null,null,null,null,{"$f":"F1form!E67","v":0},null,null,{"$f":"F1form!F67","v":0}]
[{"$f":"NorGiris!B30","v":""},null,null,null,null,{"$f":"NorGiris!F30","v":""},null,null,null,null,null,null,null,null,null,null,null,null,null,null,null,null,null,null,{"$f":"NorGiris!U30","v":""},null,null,{"$f":"NorGiris!W30","v":""},null,null,null,{"$f":"F1form!C68","v":0},null,null,null,null,{"$f":"F1form!D68","v":0},null,null,null,null,null,null,null,null,null,null,null,null,null,null,null,null,null,null,{"$f":"F1form!E68","v":0},null,null,{"$f":"F1form!F68","v":0}]
[{"$f":"NorGiris!B31","v":""},null,null,null,null,{"$f":"NorGiris!F31","v":""},null,null,null,null,null,null,null,null,null,null,null,null,null,null,null,null,null,null,{"$f":"NorGiris!U31","v":""},null,null,{"$f":"NorGiris!W31","v":""},null,null,null,{"$f":"F1form!C69","v":0},null,null,null,null,{"$f":"F1form!D69","v":0},null,null,null,null,null,null,null,null,null,null,null,null,null,null,null,null,null,null,{"$f":"F1form!E69","v":0},null,null,{"$f":"F1form!F69","v":0}]
["TOPLAM",null,null,null,null,null,null,null,null,null,null,null,null,null,null,null,null,null,null,null,null,null,null,null,{"$f":"SUM(Y27:AA36)","v":4},null,null,{"$f":"SUM(AB27:AD36)","v":0},null,null,null,"TOPLAM",null,null,null,null,null,null,null,null,null,null,null,null,null,null,null,null,null,null,null,null,null,null,null,{"$f":"SUM(BD27:BF36)","v":0},null,null,{"$f":"SUM(BG27:BJ36)","v":0}]
[null,null,null,null,null,null,null,null,null,null,null,null,null,null,null,null,null,null,null,null,null,null,null,null,null,null,null,null,null,null,null,null,null,null,null,null,null,null,null,null,null,null,null,null,null,null,null,null,null,null,null,null,null,null,null,null,null,null,null,null,null,null,null,"ders",null,null,null,null,null,null,null,null,null,null,null,"dig fal.","dig fal."]
["Çizelge 6- Yapılmayan Dersler",null,null,null,null,null,null,null,null,null,null,null,null,null,null,null,null,null,null,null,null,null,null,null,null,null,null,null,null,null,null,null,null,"Çizelge 8- Haftalık Ders Yükleri Dağılımı",null,null,null,null,null,null,null,null,null,null,null,null,null,null,null,null,null,null,null,null,null,null,null,null,null,null,null,null,null,"borc",null,null,null,null,null,null,null,null,null,null,null,"alacak","alacak"]
["Der.Kodu ve Adı",null,null,null,null,null,null,null,null,null,null,null,null,null,null,null,null,null,null,"Teo.",null,null,"Diğ.",null,null,"Y.Hafta",null,null,null,null,null,null,null,"1. Hafta",null,null,null,null,null,null,null,"Teo.",null,null,"Diğ.",null,null,"Zorunlu           Ders           Yükü",null,null,null,null,null,null,"Haftalık Ücrete Tabi Ders Yükü (20)**"]
[{"$f":"IF(Z41=0,\"\",NorGiris!B36)","v":""},null,null,null,null,{"$f":"IF(Z41=0,\"\",NorGiris!F36)","v":""},null,null,null,null,null,null,null,null,null,null,null,null,null,{"$f":"IF(Z41=0,\"\",NorGiris!U36)","v":""},null,null,{"$f":"IF(Z41=0,\"\",NorGiris!W36)","v":""},null,null,{"$f":"NorGiris!Y36","v":0},null,null,null,null,null,null,null,"Haf.Ders Yükü",null,null,null,null,null,null,null,{"$f":"Y37","v":4},null,null,{"$f":"AB37","v":0}]
[{"$f":"IF(Z42=0,\"\",NorGiris!B37)","v":""},null,null,null,null,{"$f":"IF(Z42=0,\"\",NorGiris!F37)","v":""},null,null,null,null,null,null,null,null,null,null,null,null,null,{"$f":"IF(Z42=0,\"\",NorGiris!U37)","v":""},null,null,{"$f":"IF(Z42=0,\"\",NorGiris!W37)","v":""},null,null,{"$f":"NorGiris!Y37","v":0},null,null,null,null,null,null,null,"Ara Sın. Yükü",null,null,null,null,null,null,null,null,null,null,{"$f":"NorGiris!AR62","v":0}]
[{"$f":"IF(Z43=0,\"\",NorGiris!B38)","v":""},null,null,null,null,{"$f":"IF(Z43=0,\"\",NorGiris!F38)","v":""},null,null,null,null,null,null,null,null,null,null,null,null,null,{"$f":"IF(Z43=0,\"\",NorGiris!U38)","v":""},null,null,{"$f":"IF(Z43=0,\"\",NorGiris!W38)","v":""},null,null,{"$f":"NorGiris!Y38","v":0},null,null,null,null,null,null,null,"Yapılmya Ders.",null,null,null,null,null,null,null,{"$f":"NorGiris!V62","v":0},null,null,{"$f":"NorGiris!W62","v":0}]
[{"$f":"IF(Z44=0,\"\",NorGiris!B39)","v":""},null,null,null,null,{"$f":"IF(Z44=0,\"\",NorGiris!F39)","v":""},null,null,null,null,null,null,null,null,null,null,null,null,null,{"$f":"IF(Z44=0,\"\",NorGiris!U39)","v":""},null,null,{"$f":"IF(Z44=0,\"\",NorGiris!W39)","v":""},null,null,{"$f":"NorGiris!Y39","v":0},null,null,null,null,null,null,null,"Ara Toplam",null,null,null,null,null,null,null,{"$f":"(AP41+AP42)-AP43","v":4},null,null,{"$f":"IF((AS41+AS42)-AS43>10,10,(AS41+AS42)-AS43)","v":0}]
[{"$f":"IF(Z45=0,\"\",NorGiris!B40)","v":""},null,null,null,null,{"$f":"IF(Z45=0,\"\",NorGiris!F40)","v":""},null,null,null,null,null,null,null,null,null,null,null,null,null,{"$f":"IF(Z45=0,\"\",NorGiris!U40)","v":""},null,null,{"$f":"IF(Z45=0,\"\",NorGiris!W40)","v":""},null,null,{"$f":"NorGiris!Y40","v":0},null,null,null,null,null,null,null,"Haftalık Top.*",null,null,null,null,null,null,null,{"$f":"AP44+AS44","v":4},null,null,null,null,null,{"$f":"IF($BI$3>=1,$BA$3,0)","v":4},null,null,null,null,null,null,{"$f":"IF((AP45-AV45)<0,0,IF((AP45-AV45)>20,20,(AP45-AV45)))","v":0},null,null,null,null,null,null,null,null,{"$f":"IF(AP45<AV45,(AV45-AP45),0)","v":0},null,null,null,null,null,null,null,null,null,null,null,{"$f":"IF(AS44>0,10-AS44,0)","v":0},{"$f":"IF(BX45<1,0,BX45)","v":0}]
[{"$f":"IF(Z46=0,\"\",NorGiris!B41)","v":""},null,null,null,null,{"$f":"IF(Z46=0,\"\",NorGiris!F41)","v":""},null,null,null,null,null,null,null,null,null,null,null,null,null,{"$f":"IF(Z46=0,\"\",NorGiris!U41)","v":""},null,null,{"$f":"IF(Z46=0,\"\",NorGiris!W41)","v":""},null,null,{"$f":"NorGiris!Y41","v":0},null,null,null,null,null,null,null,"2. Hafta",null,null,null,null,null,null,null,"Teo.",null,null,"Diğ.",null,null,"Zorunlu           Ders           Yükü",null,null,null,null,null,null,"Haftalık Ücrete Tabi Ders Yükü (20)**"]
[{"$f":"IF(Z47=0,\"\",NorGiris!B42)","v":""},null,null,null,null,{"$f":"IF(Z47=0,\"\",NorGiris!F42)","v":""},null,null,null,null,null,null,null,null,null,null,null,null,null,{"$f":"IF(Z47=0,\"\",NorGiris!U42)","v":""},null,null,{"$f":"IF(Z47=0,\"\",NorGiris!W42)","v":""},null,null,{"$f":"NorGiris!Y42","v":0},null,null,null,null,null,null,null,"Haf.Ders Yükü",null,null,null,null,null,null,null,{"$f":"IF($BI$3>=2,AP41,0)","v":0},null,null,{"$f":"IF($BI$3>=2,AS41,0)","v":0}]
[{"$f":"IF(Z48=0,\"\",NorGiris!B43)","v":""},null,null,null,null,{"$f":"IF(Z48=0,\"\",NorGiris!F43)","v":""},null,null,null,null,null,null,null,null,null,null,null,null,null,{"$f":"IF(Z48=0,\"\",NorGiris!U43)","v":""},null,null,{"$f":"IF(Z48=0,\"\",NorGiris!W43)","v":""},null,null,{"$f":"NorGiris!Y43","v":0},null,null,null,null,null,null,null,"Ara Sın. Yükü",null,null,null,null,null,null,null,null,null,null,{"$f":"NorGiris!AU62","v":0}]
[{"$f":"IF(Z49=0,\"\",NorGiris!B44)","v":""},null,null,null,null,{"$f":"IF(Z49=0,\"\",NorGiris!F44)","v":""},null,null,null,null,null,null,null,null,null,null,null,null,null,{"$f":"IF(Z49=0,\"\",NorGiris!U44)","v":""},null,null,{"$f":"IF(Z49=0,\"\",NorGiris!W44)","v":""},null,null,{"$f":"NorGiris!Y44","v":0},null,null,null,null,null,null,null,"Yapılmya Ders.",null,null,null,null,null,null,null,{"$f":"NorGiris!Y62","v":0},null,null,{"$f":"NorGiris!Z62","v":0}]
[{"$f":"IF(Z50=0,\"\",NorGiris!B45)","v":""},null,null,null,null,{"$f":"IF(Z50=0,\"\",NorGiris!F45)","v":""},null,null,null,null,null,null,null,null,null,null,null,null,null,{"$f":"IF(Z50=0,\"\",NorGiris!U45)","v":""},null,null,{"$f":"IF(Z50=0,\"\",NorGiris!W45)","v":""},null,null,{"$f":"NorGiris!Y45","v":0},null,null,null,null,null,null,null,"Ara Toplam",null,null,null,null,null,null,null,{"$f":"(AP47+AP48)-AP49","v":0},null,null,{"$f":"IF((AS47+AS48)-AS49>10,10,(AS47+AS48)-AS49)","v":0}]
["TOPLAM",null,null,null,null,null,null,null,null,null,null,null,null,null,null,null,null,null,null,{"$f":"SUM(T41:V50)","v":0},null,null,{"$f":"SUM(W41:Y50)","v":0},null,null,null,null,null,null,null,null,null,null,"Haftalık Top.-",null,null,null,null,null,null,null,{"$f":"AP50+AS50","v":0},null,null,null,null,null,{"$f":"IF($BI$3>=2,$BA$3,0)","v":0},null,null,null,null,null,null,{"$f":"IF((AP51-AV51)<0,0,IF((AP51-AV51)>20,20,(AP51-AV51)))","v":0},null,null,null,null,null,null,null,null,{"$f":"IF(AP51<AV51,(AV51-AP51),0)","v":0},null,null,null,null,null,null,null,null,null,null,null,{"$f":"IF(AS50>0,10-AS50,0)","v":0},{"$f":"IF(BX51<1,0,BX51)","v":0}]
[null,null,null,null,null,null,null,null,null,null,null,null,null,null,null,null,null,null,null,null,null,null,null,null,null,null,null,null,null,null,null,null,null,"3. Hafta",null,null,null,null,null,null,null,"Teo.",null,null,"Diğ.",null,null,"Zorunlu           Ders           Yükü",null,null,null,null,null,null,"Haftalık Ücrete Tabi Ders Yükü (20)**"]
[null,null,null,null,null,null,null,null,null,null,null,null,null,null,null,null,null,null,null,null,null,null,null,null,null,null,null,null,null,null,null,null,null,"Haf.Ders Yükü",null,null,null,null,null,null,null,{"$f":"IF($BI$3>=3,AP47,0)","v":0},null,null,{"$f":"IF($BI$3>=3,AS47,0)","v":0}]
[null,null,null,null,null,null,null,null,null,null,null,null,null,null,null,null,null,null,null,null,null,null,null,null,null,null,null,null,null,null,null,null,null,"Ara Sın. Yükü",null,null,null,null,null,null,null,null,null,null,{"$f":"NorGiris!AX62","v":0}]
["Çizlge 7- Ara Sınavlar",null,null,null,null,null,null,null,null,null,null,null,null,null,null,null,null,null,null,null,null,null,null,null,null,null,null,null,null,null,null,null,null,"Yapılmya Ders.",null,null,null,null,null,null,null,{"$f":"NorGiris!AB62","v":0},null,null,{"$f":"NorGiris!AC62","v":0}]
["Der.Kodu ve Adı",null,null,null,null,null,null,null,null,null,null,null,null,null,null,null,null,"Tarih",null,null,null,null,"Öğr.Say.",null,null,null,"A.Sın.Yük.",null,null,null,null,null,null,"Ara Toplam",null,null,null,null,null,null,null,{"$f":"(AP53+AP54)-AP55","v":0},null,null,{"$f":"IF((AS53+AS54)-AS55>10,10,(AS53+AS54)-AS55)","v":0}]
[{"$f":"IF(NorGiris!BF36<>\"\",NorGiris!AC36,\"\")","v":""},null,null,null,{"$f":"IF(A57<>\"\",NorGiris!AG36,\"\")","v":""},null,null,null,null,null,null,null,null,null,null,null,null,{"$f":"IF(A57<>\"\",NorGiris!AT36,\"\")","v":""},null,null,null,null,{"$f":"IF(A57<>\"\",NorGiris!AX36,\"\")","v":""},null,null,null,{"$f":"IF(A57<>\"\",NorGiris!BB36,\"\")","v":""},null,null,null,null,null,null,"Haftalık Top.*",null,null,null,null,null,null,null,{"$f":"AP56+AS56","v":0},null,null,null,null,null,{"$f":"IF($BI$3>=3,$BA$3,0)","v":0},null,null,null,null,null,null,{"$f":"IF((AP57-AV57)<0,0,IF((AP57-AV57)>20,20,(AP57-AV57)))","v":0},null,null,null,null,null,null,null,null,{"$f":"IF(AP57<AV57,(AV57-AP57),0)","v":0},null,null,null,null,null,null,null,null,null,null,null,{"$f":"IF(AS56>0,10-AS56,0)","v":0},{"$f":"IF(BX57<1,0,BX57)","v":0}]
[{"$f":"IF(NorGiris!BF37<>\"\",NorGiris!AC37,\"\")","v":""},null,null,null,{"$f":"IF(A58<>\"\",NorGiris!AG37,\"\")","v":""},null,null,null,null,null,null,null,null,null,null,null,null,{"$f":"IF(A58<>\"\",NorGiris!AT37,\"\")","v":""},null,null,null,null,{"$f":"IF(A58<>\"\",NorGiris!AX37,\"\")","v":""},null,null,null,{"$f":"IF(A58<>\"\",NorGiris!BB37,\"\")","v":""},null,null,null,null,null,null,"4. Hafta",null,null,null,null,null,null,null,"Teo.",null,null,"Diğ.",null,null,"Zorunlu           Ders           Yükü",null,null,null,null,null,null,"Haftalık Ücrete Tabi Ders Yükü (20)**"]
[{"$f":"IF(NorGiris!BF38<>\"\",NorGiris!AC38,\"\")","v":""},null,null,null,{"$f":"IF(A59<>\"\",NorGiris!AG38,\"\")","v":""},null,null,null,null,null,null,null,null,null,null,null,null,{"$f":"IF(A59<>\"\",NorGiris!AT38,\"\")","v":""},null,null,null,null,{"$f":"IF(A59<>\"\",NorGiris!AX38,\"\")","v":""},null,null,null,{"$f":"IF(A59<>\"\",NorGiris!BB38,\"\")","v":""},null,null,null,null,null,null,"Haf.Ders Yükü",null,null,null,null,null,null,null,{"$f":"IF($BI$3>=4,AP53,0)","v":0},null,null,{"$f":"IF($BI$3>=4,AS53,0)","v":0}]
[{"$f":"IF(NorGiris!BF39<>\"\",NorGiris!AC39,\"\")","v":""},null,null,null,{"$f":"IF(A60<>\"\",NorGiris!AG39,\"\")","v":""},null,null,null,null,null,null,null,null,null,null,null,null,{"$f":"IF(A60<>\"\",NorGiris!AT39,\"\")","v":""},null,null,null,null,{"$f":"IF(A60<>\"\",NorGiris!AX39,\"\")","v":""},null,null,null,{"$f":"IF(A60<>\"\",NorGiris!BB39,\"\")","v":""},null,null,null,null,null,null,"Ara Sın. Yükü",null,null,null,null,null,null,null,null,null,null,{"$f":"NorGiris!BA62","v":0}]
[{"$f":"IF(NorGiris!BF40<>\"\",NorGiris!AC40,\"\")","v":""},null,null,null,{"$f":"IF(A61<>\"\",NorGiris!AG40,\"\")","v":""},null,null,null,null,null,null,null,null,null,null,null,null,{"$f":"IF(A61<>\"\",NorGiris!AT40,\"\")","v":""},null,null,null,null,{"$f":"IF(A61<>\"\",NorGiris!AX40,\"\")","v":""},null,null,null,{"$f":"IF(A61<>\"\",NorGiris!BB40,\"\")","v":""},null,null,null,null,null,null,"Yapılmya Ders.",null,null,null,null,null,null,null,{"$f":"NorGiris!AE62","v":0},null,null,{"$f":"NorGiris!AF62","v":0}]
[{"$f":"IF(NorGiris!BF41<>\"\",NorGiris!AC41,\"\")","v":""},null,null,null,{"$f":"IF(A62<>\"\",NorGiris!AG41,\"\")","v":""},null,null,null,null,null,null,null,null,null,null,null,null,{"$f":"IF(A62<>\"\",NorGiris!AT41,\"\")","v":""},null,null,null,null,{"$f":"IF(A62<>\"\",NorGiris!AX41,\"\")","v":""},null,null,null,{"$f":"IF(A62<>\"\",NorGiris!BB41,\"\")","v":""},null,null,null,null,null,null,"Ara Toplam",null,null,null,null,null,null,null,{"$f":"(AP59+AP60)-AP61","v":0},null,null,{"$f":"IF((AS59+AS60)-AS61>10,10,(AS59+AS60)-AS61)","v":0}]
[{"$f":"IF(NorGiris!BF42<>\"\",NorGiris!AC42,\"\")","v":""},null,null,null,{"$f":"IF(A63<>\"\",NorGiris!AG42,\"\")","v":""},null,null,null,null,null,null,null,null,null,null,null,null,{"$f":"IF(A63<>\"\",NorGiris!AT42,\"\")","v":""},null,null,null,null,{"$f":"IF(A63<>\"\",NorGiris!AX42,\"\")","v":""},null,null,null,{"$f":"IF(A63<>\"\",NorGiris!BB42,\"\")","v":""},null,null,null,null,null,null,"Haftalık Top.*",null,null,null,null,null,null,null,{"$f":"AP62+AS62","v":0},null,null,null,null,null,{"$f":"IF($BI$3>=4,$BA$3,0)","v":0},null,null,null,null,null,null,{"$f":"IF((AP63-AV63)<0,0,IF((AP63-AV63)>20,20,(AP63-AV63)))","v":0},null,null,null,null,null,null,null,null,{"$f":"IF(AP63<AV63,(AV63-AP63),0)","v":0},null,null,null,null,null,null,null,null,null,null,null,{"$f":"IF(AS62>0,10-AS62,0)","v":0},{"$f":"IF(BX63<1,0,BX63)","v":0}]
[{"$f":"IF(NorGiris!BF43<>\"\",NorGiris!AC43,\"\")","v":""},null,null,null,{"$f":"IF(A64<>\"\",NorGiris!AG43,\"\")","v":""},null,null,null,null,null,null,null,null,null,null,null,null,{"$f":"IF(A64<>\"\",NorGiris!AT43,\"\")","v":""},null,null,null,null,{"$f":"IF(A64<>\"\",NorGiris!AX43,\"\")","v":""},null,null,null,{"$f":"IF(A64<>\"\",NorGiris!BB43,\"\")","v":""},null,null,null,null,null,null,"5. Hafta",null,null,null,null,null,null,null,"Teo.",null,null,"Diğ.",null,null,"Zorunlu           Ders           Yükü",null,null,null,null,null,null,"Haftalık Ücrete Tabi Ders Yükü (20)**"]
[{"$f":"IF(NorGiris!BF44<>\"\",NorGiris!AC44,\"\")","v":""},null,null,null,{"$f":"IF(A65<>\"\",NorGiris!AG44,\"\")","v":""},null,null,null,null,null,null,null,null,null,null,null,null,{"$f":"IF(A65<>\"\",NorGiris!AT44,\"\")","v":""},null,null,null,null,{"$f":"IF(A65<>\"\",NorGiris!AX44,\"\")","v":""},null,null,null,{"$f":"IF(A65<>\"\",NorGiris!BB44,\"\")","v":""},null,null,null,null,null,null,"Haf.Ders Yükü",null,null,null,null,null,null,null,{"$f":"IF($BI$3>=5,AP59,0)","v":0},null,null,{"$f":"IF($BI$3>=5,AS59,0)","v":0}]
[{"$f":"IF(NorGiris!BF45<>\"\",NorGiris!AC45,\"\")","v":""},null,null,null,{"$f":"IF(A66<>\"\",NorGiris!AG45,\"\")","v":""},null,null,null,null,null,null,null,null,null,null,null,null,{"$f":"IF(A66<>\"\",NorGiris!AT45,\"\")","v":""},null,null,null,null,{"$f":"IF(A66<>\"\",NorGiris!AX45,\"\")","v":""},null,null,null,{"$f":"IF(A66<>\"\",NorGiris!BB45,\"\")","v":""},null,null,null,null,null,null,"Ara Sın. Yükü",null,null,null,null,null,null,null,null,null,null,{"$f":"NorGiris!BD62","v":0}]
["TOPLAM",null,null,null,null,null,null,null,null,null,null,null,null,null,null,null,null,null,null,null,null,null,null,null,null,null,{"$f":"SUM(AA57:AE66)","v":0},null,null,null,null,null,null,"Yapılmya Ders.",null,null,null,null,null,null,null,{"$f":"NorGiris!AH62","v":0},null,null,{"$f":"NorGiris!AI62","v":0}]
[null,null,null,null,null,null,null,null,null,null,null,null,null,null,null,null,null,null,null,null,null,null,null,null,null,null,null,null,null,null,null,null,null,"Ara Toplam",null,null,null,null,null,null,null,{"$f":"(AP65+AP66)-AP67","v":0},null,null,{"$f":"IF((AS65+AS66)-AS67>10,10,(AS65+AS66)-AS67)","v":0}]
[null,null,null,null,null,null,null,null,null,null,null,null,null,null,null,null,null,null,null,null,null,null,null,null,null,null,null,null,null,null,null,null,null,"Haftalık Top.*",null,null,null,null,null,null,null,{"$f":"AP68+AS68","v":0},null,null,null,null,null,{"$f":"IF($BI$3>=5,$BA$3,0)","v":0},null,null,null,null,null,null,{"$f":"IF((AP69-AV69)<0,0,IF((AP69-AV69)>20,20,(AP69-AV69)))","v":0},null,null,null,null,null,null,null,null,{"$f":"IF(AP69<AV69,(AV69-AP69),0)","v":0},null,null,null,null,null,null,null,null,null,null,null,{"$f":"IF(AS68>0,10-AS68,0)","v":0},{"$f":"IF(BX69<1,0,BX69)","v":0}]
[null,null,null,null,null,null,null,null,null,null,null,null,null,null,null,null,null,{"$f":"MONTH('Bilgi-27'!N15)","v":9},null,null,{"$f":"MONTH('Bilgi-27'!T15)","v":10},null,null,null,null,null,null,null,null,null,null,null,null,"AYLIK ÜCRETE TABİ DERS YÜKÜ (Saat/Ay)",null,null,null,null,null,null,null,null,null,null,null,null,null,null,null,null,null,null,null,null,null,null,null,{"$f":"BC69+BC63+BC57+BC51+BC45","v":0},null,null,null,null,null,{"$f":"IF(AP70<AV70,-1*(AV70-AP70),0)","v":0},null,null,null,null,null,null,null,null,null,null,null,null,null,null,null,null,null,{"$f":"IF(O70=R70,1,0)","v":0}]
[]
[null,null,"İlgili Öğretim Elemanınca",null,null,null,null,null,null,null,null,null,null,null,{"$f":"'Bilgi-27'!N15","v":"2025-09-27"},null,null,{"$f":"IF(R70=U70,\"\",\"/\")","v":"/"},{"$f":"IF(R70=U70,\"\",'Bilgi-27'!T15)","v":"2025-10-01"},null,{"$f":"O72","v":"2025-09-27"},null,null,"ayında toplam",null,null,null,null,null,null,{"$f":"SUM(AP69,AP63,AP57,AP51,AP45)","v":4},null,"(",{"$f":"sayi(AE72)","v":"Dört"},null,null,null,null,")","saat ders okutulmuş olup, bunun",null,null,null,null,null,null,null,null,null,null,null,null,null,null,null,null,null,null,null,null,null,null,null,null,null,null,null,null,null,null,null,null,null,null,null,null,null,null,null,null,null,null,{"$f":"\" \"","v":" "}]
[{"$f":"BF70","v":0},null,"(",{"$f":"sayi(BF70)","v":" Sıfır "},null,null,null,null,")","saatinden ücret talep edilmektedir."]
["*",null,"Diğer faaliyetler (Normal Öğretim + İkinci Öğretim 10 saati geçemez.)"]
["**",null,"Haftalık ücrete tabi ders yükü (Normal Öğretim için 20 saati geçemez)"]
[null,null,null,null,null,null,null,null,null,null,null,null,null,null,null,null,null,null,null,null,null,null,null,null,null,null,null,null,null,null,null,null,null,null,null,null,null,null,null,null,null,null,null,null,null,null,null,null,null,null,null,"Onay"]
[null,null,null,null,"Bildiri Sahibi",null,null,null,null,null,null,null,null,null,null,null,null,null,null,"Bölüm Başkanı",null,null,null,null,null,null,null,null,null,null,null,null,null,null,null,null,null,null,null,null,null,null,null,null,{"$f":"'Bilgi-27'!Z11","v":"Müdür"}]
[null,{"$f":"I3","v":"Öğr.Gör. Celalettin AYDIN"},null,null,null,null,null,null,null,null,null,null,null,null,null,null,null,null,null,{"$f":"'Bilgi-27'!Z13","v":"Ögr. Gör. Celalettin AYDIN"},null,null,null,null,null,null,null,null,null,null,null,null,null,null,null,null,null,null,null,null,null,null,null,null,{"$f":"'Bilgi-27'!Z12","v":"Prof. Dr. Mutlu AVCI"}]

{"sheet":"NorForm-y","index":5,"n_rows":75,"n_cols":74,"rows_kept":75,"cut":false,"hidden":false,"merged":[[58,18,58,23],[58,24,58,28],[48,71,48,72],[50,71,50,72],[47,71,47,72],[51,71,51,81],[22,3,22,5],[22,6,22,8],[22,9,22,11],[22,12,22,14],[22,15,22,17],[22,18,22,20],[22,21,22,23],[22,24,22,26],[22,27,22,30],[40,0,40,12],[41,0,41,12],[58,0,58,17],[55,65,56,67],[56,0,56,17],[57,0,57,17],[53,65,54,67],[54,0,54,17],[54,29,54,33],[21,3,21,5],[21,6,21,8],[21,9,21,11],[21,12,21,14],[21,15,21,17],[21,18,21,20],[21,21,21,23],[21,24,21,26],[21,27,21,30],[20,3,20,5],[20,6,20,8],[20,9,20,11],[20,12,20,14],[20,15,20,17],[20,18,20,20],[20,21,20,23],[20,24,20,26],[20,27,20,30],[19,3,19,5],[19,6,19,8],[19,9,19,11],[19,12,19,14],[19,15,19,17],[19,18,19,20],[19,21,19,23],[19,24,19,26],[19,27,19,30],[18,3,18,5],[18,6,18,8],[18,9,18,11],[18,12,18,14],[18,15,18,17],[18,18,18,20],[18,21,18,23],[18,24,18,26],[18,27,18,30],[16,24,16,26],[16,27,16,30],[17,9,17,11],[17,12,17,14],[17,15,17,17],[17,18,17,20],[17,21,17,23],[17,24,17,26],[17,27,17,30],[13,21,13,23],[14,21,14,23],[13,24,13,26],[14,24,14,26],[13,27,13,30],[14,27,14,30],[51,53,51,55],[68,56,68,64],[42,53,42,55],[43,53,43,55],[49,53,49,55],[50,53,50,55],[68,20,68,23],[68,24,68,33],[56,18,56,23],[56,24,56,28],[56,29,56,33],[57,18,57,23],[57,24,57,28],[57,29,57,33],[56,35,59,64],[54,18,54,23],[54,24,54,28],[15,18,15,20],[7,3,7,8],[7,12,7,15],[8,3,8,6],[8,7,8,17],[8,30,8,33],[9,3,9,12],[11,23,11,32],[35,53,35,55],[41,53,41,55],[19,53,19,55],[25,53,25,55],[26,53,26,55],[27,53,27,55],[33,53,33,55],[34,53,34,55],[34,17,34,29],[35,17,35,29],[38,17,38,29],[40,17,40,29],[41,17,41,29],[38,0,38,12],[33,0,33,12],[32,0,32,12],[39,0,39,12],[71,24,71,33],[42,13,42,14],[43,13,43,14],[44,13,44,14],[45,13,45,14],[42,30,42,31],[44,32,44,33],[45,32,45,33],[70,16,70,19],[70,20,70,23],[70,24,70,33],[64,16,64,19],[64,20,64,23],[65,16,65,19],[65,20,65,23],[65,24,65,33],[58,29,58,33],[64,0,64,15],[46,0,46,12],[46,13,46,14],[66,16,66,19],[66,20,66,23],[68,0,68,15],[68,16,68,19],[74,3,76,10],[74,11,76,17],[74,18,76,26],[5,9,5,26],[71,16,71,19],[26,0,26,12],[34,0,34,12],[35,0,35,12],[36,0,36,12],[37,0,37,12],[27,17,27,29],[71,20,71,23],[69,0,69,15],[69,16,69,19],[69,20,69,23],[69,24,69,33],[70,0,70,15],[41,13,41,14],[31,30,31,31],[31,32,31,33],[31,0,31,12],[21,0,22,2],[64,24,64,33],[65,0,65,15],[1,34,1,41],[2,34,2,41],[3,34,3,41],[4,34,4,41],[5,34,5,41],[1,2,5,8],[3,9,3,26],[1,9,1,26],[2,9,2,26],[4,9,4,26],[1,27,1,33],[2,27,2,33],[3,27,3,33],[4,27,4,33],[5,27,5,33],[66,0,66,15],[66,24,66,33],[67,0,67,15],[67,16,67,19],[67,20,67,23],[67,24,67,33],[59,29,59,33],[61,31,61,32],[62,0,63,15],[62,24,63,33],[59,0,59,17],[54,62,55,64],[55,0,55,17],[55,18,55,23],[55,24,55,28],[55,29,55,33],[52,59,53,61],[52,62,53,64],[53,0,53,17],[53,18,53,23],[53,24,53,28],[53,29,53,33],[54,35,55,61],[51,48,51,49],[51,50,51,52],[52,0,52,17],[52,18,52,23],[52,24,52,28],[52,29,52,33],[52,35,53,42],[52,45,53,52],[51,0,51,17],[51,18,51,23],[51,24,51,28],[51,29,51,33],[51,43,51,44],[51,45,51,47],[50,0,50,17],[50,18,50,23],[50,24,50,28],[50,29,50,33],[50,43,50,44],[50,45,50,47],[50,48,50,49],[50,50,50,52],[50,56,50,58],[47,35,47,42],[48,35,48,42],[49,43,49,44],[49,45,49,47],[49,48,49,49],[49,50,49,52],[44,62,45,64],[44,65,45,67],[45,15,45,16],[46,15,46,16],[46,17,46,29],[46,30,46,31],[46,32,46,33],[46,43,48,44],[49,56,49,58],[39,35,39,42],[43,59,43,61],[44,0,45,10],[44,15,44,16],[44,17,45,27],[44,35,45,42],[44,45,45,52],[44,59,45,61],[43,30,43,31],[44,30,44,31],[45,30,45,31],[42,0,43,10],[42,56,42,58],[43,15,43,16],[43,43,43,44],[43,45,43,47],[43,48,43,49],[43,50,43,52],[42,32,42,33],[43,32,43,33],[41,48,41,49],[41,50,41,52],[41,56,41,58],[42,15,42,16],[42,17,43,27],[42,43,42,44],[42,45,42,47],[42,48,42,49],[42,50,42,52],[41,15,41,16],[41,30,41,31],[41,32,41,33],[41,43,41,44],[41,45,41,47],[40,13,40,14],[40,15,40,16],[40,30,40,31],[40,32,40,33],[40,35,40,42],[37,65,37,67],[38,13,38,14],[38,15,38,16],[38,30,38,31],[38,32,38,33],[38,43,40,44],[39,13,39,14],[39,15,39,16],[39,30,39,31],[39,32,39,33],[36,59,37,61],[36,62,37,64],[37,13,37,14],[37,15,37,16],[37,30,37,31],[37,32,37,33],[36,17,36,29],[37,17,37,29],[39,17,39,29],[35,50,35,52],[33,17,33,29],[36,13,36,14],[36,15,36,16],[36,30,36,31],[36,32,36,33],[36,35,37,42],[36,45,37,52],[34,48,34,49],[34,50,34,52],[35,13,35,14],[35,15,35,16],[35,30,35,31],[35,32,35,33],[35,43,35,44],[35,45,35,47],[35,48,35,49],[33,45,33,47],[33,48,33,49],[34,13,34,14],[34,15,34,16],[34,30,34,31],[34,32,34,33],[34,43,34,44],[34,56,34,58],[33,50,33,52],[33,56,33,58],[28,59,29,61],[32,30,32,31],[32,32,32,33],[32,35,32,42],[30,0,30,12],[30,13,30,14],[32,13,32,14],[32,15,32,16],[32,17,32,29],[34,45,34,47],[33,43,33,44],[33,13,33,14],[33,15,33,16],[33,30,33,31],[33,32,33,33],[30,17,30,29],[31,13,31,14],[31,15,31,16],[31,17,31,29],[28,62,29,64],[29,0,29,12],[29,13,29,14],[29,15,29,16],[29,17,29,29],[29,30,29,31],[29,32,29,33],[28,17,28,29],[31,35,31,42],[30,43,32,44],[30,15,30,16],[30,30,30,31],[30,32,30,33],[27,48,27,49],[27,50,27,52],[28,0,28,12],[28,13,28,14],[28,15,28,16],[28,30,28,31],[28,32,28,33],[28,45,29,52],[26,48,26,49],[26,50,26,52],[26,56,26,58],[27,0,27,12],[27,13,27,14],[27,15,27,16],[27,30,27,31],[27,32,27,33],[27,43,27,44],[27,45,27,47],[25,48,25,49],[25,50,25,52],[25,56,25,58],[26,13,26,14],[26,15,26,16],[26,17,26,29],[26,30,26,31],[26,32,26,33],[26,43,26,44],[26,45,26,47],[25,13,25,14],[25,15,25,16],[25,30,25,31],[25,32,25,33],[25,43,25,44],[25,45,25,47],[18,56,18,58],[17,53,17,55],[18,53,18,55],[17,31,18,33],[17,43,17,44],[17,45,17,47],[17,3,17,5],[17,6,17,8],[21,65,22,67],[22,43,24,44],[23,35,23,42],[24,13,24,16],[24,30,24,33],[24,35,24,42],[20,62,21,64],[20,59,21,61],[19,48,19,49],[19,50,19,52],[20,35,21,42],[20,45,21,52],[19,45,19,47],[21,31,22,33],[19,31,20,33],[19,43,19,44],[17,0,18,2],[15,0,16,2],[15,3,15,5],[15,6,15,8],[15,9,15,11],[15,12,15,14],[19,0,20,2],[17,48,17,49],[17,50,17,52],[18,43,18,44],[18,45,18,47],[18,48,18,49],[18,50,18,52],[15,15,15,17],[15,21,15,23],[15,24,15,26],[15,27,15,30],[16,3,16,5],[16,6,16,8],[16,9,16,11],[16,12,16,14],[16,15,16,17],[16,18,16,20],[16,21,16,23],[12,3,12,5],[12,6,12,8],[12,9,12,11],[12,12,12,14],[12,15,12,17],[12,18,12,20],[13,0,14,2],[13,3,13,5],[14,3,14,5],[13,6,13,8],[14,6,14,8],[13,9,13,11],[14,9,14,11],[13,12,13,14],[14,12,14,14],[13,15,13,17],[14,15,14,17],[13,18,13,20],[14,18,14,20],[11,62,11,64],[11,65,11,67],[9,21,9,23],[9,25,9,27],[69,56,69,64],[69,46,69,52],[68,36,68,43],[64,57,64,64],[64,47,64,52],[66,54,67,63],[66,35,67,45],[66,46,67,53],[12,31,12,33],[12,62,12,64],[12,65,12,67],[12,21,12,23],[12,24,12,26],[12,27,12,30],[13,31,14,33],[14,43,16,44],[15,31,16,33],[15,35,15,42],[16,35,16,42],[17,56,17,58],[6,38,6,42],[6,43,6,47],[6,48,6,52],[6,53,6,57],[6,58,6,62],[6,63,6,64],[7,16,7,30],[8,18,8,29],[9,32,9,33]]}
[]
[null,null,{"$error":"#VALUE!"},null,null,null,null,null,null,"T.C.",null,null,null,null,null,null,null,null,null,null,null,null,null,null,null,null,null,"DOKÜMAN NO",null,null,null,null,null,null,"FRM-SGDB-0007"]
[null,null,null,null,null,null,null,null,null,"ÇUKUROVA ÜNİVERSİTESİ",null,null,null,null,null,null,null,null,null,null,null,null,null,null,null,null,null,"İLK YAYIN TARİHİ",null,null,null,null,null,null,"2024-07-16"]
[null,null,null,null,null,null,null,null,null,{"$f":"UPPER('Bilgi-27'!Z6)","v":"Ç.Ü. CEYHAN MESLEK YÜKSEKOKULU"},null,null,null,null,null,null,null,null,null,null,null,null,null,null,null,null,null,"REVİZYON TARİHİ"]
[null,null,null,null,null,null,null,null,null,null,null,null,null,null,null,null,null,null,null,null,null,null,null,null,null,null,null,"REVİZYON NO"]
[null,null,null,null,null,null,null,null,null,"EK DERS BİLDİRİM FORMU",null,null,null,null,null,null,null,null,null,null,null,null,null,null,null,null,null,"SAYFA NO",null,null,null,null,null,null,"1/1"]
[null,null,null,null,null,null,null,null,null,null,null,null,null,null,null,null,null,null,null,null,null,null,null,null,null,null,null,null,null,null,null,null,null,null,null,null,null,null,"1.H",null,null,null,null,"2.H",null,null,null,null,"3.H",null,null,null,null,"4.H",null,null,null,null,"5.H"]
["Ünvanı",null,null,{"$f":"'Bilgi-27'!Z7","v":"Öğr.Gör."},null,null,null,null,null,"Adı Soyadı",null,null,null,null,null,null,{"$f":"'Bilgi-27'!Z8","v":"Celalettin AYDIN"},null,null,null,null,null,null,null,null,null,null,null,null,null,null,null,null,null,null,"Günler",null,null,{"$f":"IF(VALUE(AG10)>=1,V10,\"\")","v":"2025-09-27"},{"$f":"IF(VALUE(AG10)>=1,AM8+1,\"\")","v":"2025-09-28"},{"$f":"IF(VALUE(AG10)>=1,AN8+1,\"\")","v":"2025-09-29"},{"$f":"IF(VALUE(AG10)>=1,AO8+1,\"\")","v":"2025-09-30"},{"$f":"IF(VALUE(AG10)>=1,AP8+1,\"\")","v":"2025-10-01"},{"$f":"IF(VALUE(AG10)>=2,AQ8+3,\"\")","v":""},{"$f":"IF(VALUE(AG10)>=2,AR8+1,\"\")","v":""},{"$f":"IF(VALUE(AG10)>=2,AS8+1,\"\")","v":""},{"$f":"IF(VALUE(AG10)>=2,AT8+1,\"\")","v":""},{"$f":"IF(VALUE(AG10)>=2,AU8+1,\"\")","v":""},{"$f":"IF(VALUE(AG10)>=3,AV8+3,\"\")","v":""},{"$f":"IF(VALUE(AG10)>=3,AW8+1,\"\")","v":""},{"$f":"IF(VALUE(AG10)>=3,AX8+1,\"\")","v":""},{"$f":"IF(VALUE(AG10)>=3,AY8+1,\"\")","v":""},{"$f":"IF(VALUE(AG10)>=3,AZ8+1,\"\")","v":""},{"$f":"IF(VALUE(AG10)>=4,BA8+3,\"\")","v":""},{"$f":"IF(VALUE(AG10)>=4,BB8+1,\"\")","v":""},{"$f":"IF(VALUE(AG10)>=4,BC8+1,\"\")","v":""},{"$f":"IF(VALUE(AG10)>=4,BD8+1,\"\")","v":""},{"$f":"IF(VALUE(AG10)>=4,BE8+1,\"\")","v":""},{"$f":"IF(VALUE(AG10)>=5,BF8+3,\"\")","v":""},{"$f":"IF(VALUE(AG10)>=5,BG8+1,\"\")","v":""},{"$f":"IF(VALUE(AG10)>=5,BH8+1,\"\")","v":""},{"$f":"IF(VALUE(AG10)>=5,BI8+1,\"\")","v":""},{"$f":"IF(VALUE(AG10)>=5,BJ8+1,\"\")","v":""}]
["İdari Görevi",null,null,{"$f":"'Bilgi-27'!Z9","v":0},null,null,null,null,null,null,null,null,null,null,null,null,null,null,"Zorunlu Ders Yükü",null,null,null,null,null,null,null,null,null,null,null,{"$f":"F1form!R42","v":0},null,null,null,null,"Teorik",null,null,{"$f":"IF(AM8<>\"\",'Bilgi-27'!$AW$21,0)","v":0},{"$f":"IF(AN8<>\"\",'Bilgi-27'!$AW$23,0)","v":0},{"$f":"IF(AO8<>\"\",'Bilgi-27'!$AW$25,0)","v":0},{"$f":"IF(AP8<>\"\",'Bilgi-27'!$AW$27,0)","v":0},{"$f":"IF(AQ8<>\"\",'Bilgi-27'!$AW$29,0)","v":4},{"$f":"IF(AR8<>\"\",'Bilgi-27'!$AW$21,0)","v":0},{"$f":"IF(AS8<>\"\",'Bilgi-27'!$AW$23,0)","v":0},{"$f":"IF(AT8<>\"\",'Bilgi-27'!$AW$25,0)","v":0},{"$f":"IF(AU8<>\"\",'Bilgi-27'!$AW$27,0)","v":0},{"$f":"IF(AV8<>\"\",'Bilgi-27'!$AW$29,0)","v":0},{"$f":"IF(AW8<>\"\",'Bilgi-27'!$AW$21,0)","v":0},{"$f":"IF(AX8<>\"\",'Bilgi-27'!$AW$23,0)","v":0},{"$f":"IF(AY8<>\"\",'Bilgi-27'!$AW$25,0)","v":0},{"$f":"IF(AZ8<>\"\",'Bilgi-27'!$AW$27,0)","v":0},{"$f":"IF(BA8<>\"\",'Bilgi-27'!$AW$29,0)","v":0},{"$f":"IF(BB8<>\"\",'Bilgi-27'!$AW$21,0)","v":0},{"$f":"IF(BC8<>\"\",'Bilgi-27'!$AW$23,0)","v":0},{"$f":"IF(BD8<>\"\",'Bilgi-27'!$AW$25,0)","v":0},{"$f":"IF(BE8<>\"\",'Bilgi-27'!$AW$27,0)","v":0},{"$f":"IF(BF8<>\"\",'Bilgi-27'!$AW$29,0)","v":0},{"$f":"IF(BG8<>\"\",'Bilgi-27'!$AW$21,0)","v":0},{"$f":"IF(BH8<>\"\",'Bilgi-27'!$AW$23,0)","v":0},{"$f":"IF(BI8<>\"\",'Bilgi-27'!$AW$25,0)","v":0},{"$f":"IF(BJ8<>\"\",'Bilgi-27'!$AW$27,0)","v":0},{"$f":"IF(BK8<>\"\",'Bilgi-27'!$AW$29,0)","v":0}]
["Bölüm :",null,null,{"$f":"'Bilgi-27'!Z10","v":"Bilgisayar Bölümü"},null,null,null,null,null,null,null,null,null,"Kapsadığı Dönem",null,null,null,null,null,null,null,{"$f":"NorForm!AX4","v":"2025-09-27"},null,null,"-",{"$f":"NorForm!BE4","v":"2025-10-01"},null,null,"Hafta Sayısı",null,null,null,{"$f":"'Bilgi-27'!N16","v":1},null,null,"Uygulama",null,null,{"$f":"IF(AM8<>\"\",'Bilgi-27'!$AW$22,0)","v":0},{"$f":"IF(AN8<>\"\",'Bilgi-27'!$AW$24,0)","v":0},{"$f":"IF(AO8<>\"\",'Bilgi-27'!$AW$26,0)","v":0},{"$f":"IF(AP8<>\"\",'Bilgi-27'!$AW$28,0)","v":0},{"$f":"IF(AQ8<>\"\",'Bilgi-27'!$AW$30,0)","v":0},{"$f":"IF(AR8<>\"\",'Bilgi-27'!$AW$22,0)","v":0},{"$f":"IF(AS8<>\"\",'Bilgi-27'!$AW$24,0)","v":0},{"$f":"IF(AT8<>\"\",'Bilgi-27'!$AW$26,0)","v":0},{"$f":"IF(AU8<>\"\",'Bilgi-27'!$AW$28,0)","v":0},{"$f":"IF(AV8<>\"\",'Bilgi-27'!$AW$30,0)","v":0},{"$f":"IF(AW8<>\"\",'Bilgi-27'!$AW$22,0)","v":0},{"$f":"IF(AX8<>\"\",'Bilgi-27'!$AW$24,0)","v":0},{"$f":"IF(AY8<>\"\",'Bilgi-27'!$AW$26,0)","v":0},{"$f":"IF(AZ8<>\"\",'Bilgi-27'!$AW$28,0)","v":0},{"$f":"IF(BA8<>\"\",'Bilgi-27'!$AW$30,0)","v":0},{"$f":"IF(BB8<>\"\",'Bilgi-27'!$AW$22,0)","v":0},{"$f":"IF(BC8<>\"\",'Bilgi-27'!$AW$24,0)","v":0},{"$f":"IF(BD8<>\"\",'Bilgi-27'!$AW$26,0)","v":0},{"$f":"IF(BE8<>\"\",'Bilgi-27'!$AW$28,0)","v":0},{"$f":"IF(BF8<>\"\",'Bilgi-27'!$AW$30,0)","v":0},{"$f":"IF(BG8<>\"\",'Bilgi-27'!$AW$22,0)","v":0},{"$f":"IF(BH8<>\"\",'Bilgi-27'!$AW$24,0)","v":0},{"$f":"IF(BI8<>\"\",'Bilgi-27'!$AW$26,0)","v":0},{"$f":"IF(BJ8<>\"\",'Bilgi-27'!$AW$28,0)","v":0},{"$f":"IF(BK8<>\"\",'Bilgi-27'!$AW$30,0)","v":0}]
["EK-1b",null,null,null,null,null,null,null,null,null,null,null,null,null,null,null,null,null,null,null,null,null,null,null,null,null,null,null,null,null,null,null,null,null,null,"Günler",null,null,null,null,null,null,null,null,null,null,null,null,null,null,null,null,null,null,null,null,null,null,null,null,null,null,"TOPLAM"]
["Çizelge 1. HAFTALIK DERS PROGRAMI",null,null,null,null,null,null,null,null,null,null,null,null,null,null,null,null,"Kapsadığı Sömestre :",null,null,null,null,null,{"$f":"'Bilgi-27'!Z3 & \" - \" &'Bilgi-27'!Z4","v":"2025-2026 - GÜZ"},null,null,null,null,null,null,null,null,null,null,null,"Teorik",null,null,null,null,null,null,null,null,null,null,null,null,null,null,null,null,null,null,null,null,null,null,null,null,null,null,{"$f":"SUM(AM9:BK9)","v":4}]
["Günler",null,null,{"$f":"'Bilgi-27'!I20","v":"08:30-09:15"},null,null,{"$f":"'Bilgi-27'!N20","v":"09:30-10:15"},null,null,{"$f":"'Bilgi-27'!S20","v":"10:30-11:15"},null,null,{"$f":"'Bilgi-27'!X20","v":"11:30-12:15"},null,null,{"$f":"'Bilgi-27'!AC20","v":"13:00-13:45"},null,null,{"$f":"'Bilgi-27'!AH20","v":"14:00-14:45"},null,null,{"$f":"'Bilgi-27'!AM20","v":"15:00-15:45"},null,null,{"$f":"'Bilgi-27'!AR20","v":"16:00-16:45"},null,null,null,null,null,null,null,null,null,null,"Uygulama",null,null,null,null,null,null,null,null,null,null,null,null,null,null,null,null,null,null,null,null,null,null,null,null,null,null,{"$f":"SUM(AM10:BK10)","v":0}]
["Pazartesi",null,null,{"$f":"'Bilgi-27'!I21","v":0},null,null,{"$f":"'Bilgi-27'!N21","v":0},null,null,{"$f":"'Bilgi-27'!S21","v":0},null,null,{"$f":"'Bilgi-27'!X21","v":0},null,null,{"$f":"'Bilgi-27'!AC21","v":0},null,null,{"$f":"'Bilgi-27'!AH21","v":0},null,null,{"$f":"'Bilgi-27'!AM21","v":0},null,null,{"$f":"'Bilgi-27'!AR21","v":0},null,null,null,null,null,null,null,null,null,null,"Çizelge 5. HAFTALARA GÖRE DERS YÜKLERİNİN DAĞILIMI"]
[null,null,null,{"$f":" 'Bilgi-27'!I22","v":0},null,null,{"$f":"'Bilgi-27'!N22","v":0},null,null,{"$f":"  'Bilgi-27'!S22","v":0},null,null,{"$f":"   'Bilgi-27'!X22","v":0},null,null,{"$f":" 'Bilgi-27'!AC22","v":0},null,null,{"$f":"  'Bilgi-27'!AH22","v":0},null,null,{"$f":" 'Bilgi-27'!AM22","v":0},null,null,{"$f":" 'Bilgi-27'!AR22","v":0},null,null,null,null,null,null,null,null,null,null,"Tarih",null,null,null,null,null,null,null,"Teori  Ders",null,null,"Diğer Faaliyetler",null,null,null,null,null,null,null,null,null,null,null,null,null,null,null,"1.Hafta"]
["Salı",null,null,{"$f":"'Bilgi-27'!I23","v":0},null,null,{"$f":"'Bilgi-27'!N23","v":0},null,null,{"$f":"'Bilgi-27'!S23","v":0},null,null,{"$f":"'Bilgi-27'!X23","v":0},null,null,{"$f":"'Bilgi-27'!AC23","v":0},null,null,{"$f":"'Bilgi-27'!AH23","v":0},null,null,{"$f":"'Bilgi-27'!AM23","v":0},null,null,{"$f":"'Bilgi-27'!AR23","v":0},null,null,null,null,null,null,null,null,null,null,null,null,null,null,null,null,null,null,null,null,"Y.Lisans",null,null,"Staj",null,"Mezuniyet",null,null,"Uygula",null,null,"Ara Sınav",null,null,null,null,null,"ücrete "]
[null,null,null,{"$f":"'Bilgi-27'!I24","v":0},null,null,{"$f":" 'Bilgi-27'!N24","v":0},null,null,{"$f":"  'Bilgi-27'!S24","v":0},null,null,{"$f":" 'Bilgi-27'!X24","v":0},null,null,{"$f":"   'Bilgi-27'!AC24","v":0},null,null,{"$f":"  'Bilgi-27'!AH24","v":0},null,null,{"$f":" 'Bilgi-27'!AM24","v":0},null,null,{"$f":"  'Bilgi-27'!AR24","v":0},null,null,null,null,null,null,null,null,null,null,null,null,null,null,null,null,null,null,null,null,"Doktora",null,null,null,null,"Çalışm.",null,null,null,null,null,null,null,null,"Zorunlu",null,null,"tabi"]
["Çarşamba",null,null,{"$f":"'Bilgi-27'!I25","v":0},null,null,{"$f":"'Bilgi-27'!N25","v":0},null,null,{"$f":"'Bilgi-27'!S25","v":0},null,null,{"$f":"'Bilgi-27'!X25","v":0},null,null,{"$f":"'Bilgi-27'!AC25","v":0},null,null,{"$f":"'Bilgi-27'!AH25","v":0},null,null,{"$f":"'Bilgi-27'!AM25","v":0},null,null,{"$f":"'Bilgi-27'!AR25","v":0},null,null,null,null,null,null,null,null,null,null,"Tüm Dersler",null,null,null,null,null,null,null,{"$f":"NorForm!AP41","v":4},null,null,null,null,null,null,null,null,null,{"$f":"NorForm!AS41","v":0},null,null,{"$f":"NorForm!AS42","v":0},null,null,"Ders",null,null,"ders"]
[null,null,null,{"$f":" 'Bilgi-27'!I26","v":0},null,null,{"$f":"'Bilgi-27'!N26","v":0},null,null,{"$f":" 'Bilgi-27'!S26","v":0},null,null,{"$f":" 'Bilgi-27'!X26","v":0},null,null,{"$f":"  'Bilgi-27'!AC26","v":0},null,null,{"$f":"'Bilgi-27'!AH26","v":0},null,null,{"$f":"'Bilgi-27'!AM26","v":0},null,null,{"$f":" 'Bilgi-27'!AR26","v":0},null,null,null,null,null,null,null,null,null,null,"Yapılamayan Dersler",null,null,null,null,null,null,null,{"$f":"NorForm!AP43","v":0},null,null,null,null,null,null,null,null,null,{"$f":"NorForm!AS43","v":0},null,null,null,null,null,"Yükü",null,null,"Yükü"]
["Perşembe",null,null,{"$f":"'Bilgi-27'!I27","v":0},null,null,{"$f":"'Bilgi-27'!N27","v":0},null,null,{"$f":"'Bilgi-27'!S27","v":0},null,null,{"$f":"'Bilgi-27'!X27","v":0},null,null,{"$f":"'Bilgi-27'!AC27","v":0},null,null,{"$f":"'Bilgi-27'!AH27","v":0},null,null,{"$f":"'Bilgi-27'!AM27","v":0},null,null,{"$f":"'Bilgi-27'!AR27","v":0},null,null,null,null,null,null,null,null,null,null,"Yapılan Dersler",null,null,null,null,null,null,null,{"$f":"NorForm!AP44","v":4},null,null,null,null,null,null,null,null,null,{"$f":"NorForm!AS44","v":0},null,null,null,"(10)*",null,{"$f":"SUM(AT21)-BH21","v":0},null,null,null,"(20)**"]
[null,null,null,{"$f":"'Bilgi-27'!I28","v":0},null,null,{"$f":" 'Bilgi-27'!N28","v":0},null,null,{"$f":" 'Bilgi-27'!S28","v":0},null,null,{"$f":"  'Bilgi-27'!X28","v":0},null,null,{"$f":"  'Bilgi-27'!AC28","v":0},null,null,{"$f":"  'Bilgi-27'!AH28","v":0},null,null,{"$f":"  'Bilgi-27'!AM28","v":0},null,null,{"$f":"  'Bilgi-27'!AR28","v":0},null,null,null,null,null,null,null,null,null,null,"Haftalık Toplam",null,null,null,null,null,null,null,null,null,{"$f":"SUM(AR20:BD20)","v":4},null,null,null,null,null,null,null,null,null,null,null,null,null,{"$f":"NorForm!AV45","v":4},null,null,{"$f":"NorForm!BC45","v":0}]
["Cuma",null,null,{"$f":"'Bilgi-27'!I29","v":0},null,null,{"$f":"'Bilgi-27'!N29","v":0},null,null,{"$f":"'Bilgi-27'!S29","v":"BLP 157"},null,null,{"$f":"'Bilgi-27'!X29","v":"BLP 157"},null,null,{"$f":"'Bilgi-27'!AC29","v":"BLP 215"},null,null,{"$f":"'Bilgi-27'!AH29","v":"BLP 215"},null,null,{"$f":"'Bilgi-27'!AM29","v":0},null,null,{"$f":"'Bilgi-27'!AR29","v":0}]
[null,null,null,{"$f":"'Bilgi-27'!I30","v":0},null,null,{"$f":" 'Bilgi-27'!N30","v":0},null,null,{"$f":"'Bilgi-27'!S30","v":0},null,null,{"$f":"'Bilgi-27'!X30","v":0},null,null,{"$f":" 'Bilgi-27'!AC30","v":0},null,null,{"$f":"  'Bilgi-27'!AH30","v":0},null,null,{"$f":"  'Bilgi-27'!AM30","v":0},null,null,{"$f":"   'Bilgi-27'!AR30","v":0},null,null,null,null,null,null,null,null,null,null,"Tarih",null,null,null,null,null,null,null,"Teori  Ders",null,null,"Diğer Faaliyetler",null,null,null,null,null,null,null,null,null,null,null,null,null,null,null,"2.Hafta"]
["Çizelge 2. DERS YÜKÜ ÇİZELGESİ",null,null,null,null,null,null,null,null,null,null,null,null,null,null,null,null,null,null,null,null,null,null,null,null,null,null,null,null,null,null,null,null,null,null,null,null,null,null,null,null,null,null,null,null,"Y.Lisans",null,null,"Staj",null,"Mezuniyet",null,null,"Uygula",null,null,"Ara Sınav",null,null,null,null,null,"ücrete "]
["Fakültede/Yüksekokulda",null,null,null,null,null,null,null,null,null,null,null,null,"Haftalık Ders",null,null,null,null,null,"Diğer Fakülte ve Yüksekokullarda",null,null,null,null,null,null,null,null,null,null,"Haftalık Ders",null,null,null,null,null,null,null,null,null,null,null,null,null,null,"Doktora",null,null,null,null,"Çalışm.",null,null,null,null,null,null,null,null,"Zorunlu",null,null,"tabi"]
["Dersin Kodu Adı",null,null,null,null,null,null,null,null,null,null,null,null,"Teori",null,"Diğer",null,null,null,"Dersin Kodu ve Adı",null,null,null,null,null,null,null,null,null,null,"Teori",null,"Diğer",null,null,"Tüm Dersler",null,null,null,null,null,null,null,{"$f":"NorForm!AP47","v":0},null,null,null,null,null,null,null,null,null,{"$f":"NorForm!AS47","v":0},null,null,{"$f":"NorForm!AS48","v":0},null,null,"Ders",null,null,"ders"]
[{"$f":"NorForm!A27 & \" \" &NorForm!F27","v":"BLP 157 Web Tasarımının Temelleri"},null,null,null,null,null,null,null,null,null,null,null,null,{"$f":"NorForm!Y27","v":2},null,{"$f":"NorForm!AB27","v":0},null,{"$f":"TEXT(NorForm!AF27,\"\")  & \"  \" & TEXT(NorForm!AK27,\"\")","v":"  "},null,null,null,null,null,null,null,null,null,null,null,null,{"$f":"NorForm!BD27","v":0},null,{"$f":"NorForm!BG27","v":0},null,null,"Yapılamayan Dersler",null,null,null,null,null,null,null,{"$f":"NorForm!AP49","v":0},null,null,null,null,null,null,null,null,null,{"$f":"NorForm!AS49","v":0},null,null,null,null,null,"Yükü",null,null,"Yükü"]
[{"$f":"NorForm!A28 & \" \" &NorForm!F28","v":"BLP 215 Sensörler"},null,null,null,null,null,null,null,null,null,null,null,null,{"$f":"NorForm!Y28","v":2},null,{"$f":"NorForm!AB28","v":0},null,{"$f":"TEXT(NorForm!AF28,\"\")  & \"  \" & TEXT(NorForm!AK28,\"\")","v":"  "},null,null,null,null,null,null,null,null,null,null,null,null,{"$f":"NorForm!BD28","v":0},null,{"$f":"NorForm!BG28","v":0},null,null,"Yapılan Dersler",null,null,null,null,null,null,null,{"$f":"NorForm!AP50","v":0},null,null,null,null,null,null,null,null,null,{"$f":"NorForm!AS50","v":0},null,null,0,"(10)*",null,{"$f":"SUM(AT29)-BH29","v":0},null,null,null,"(20)**"]
[{"$f":"NorForm!A29 & \" \" &NorForm!F29","v":" "},null,null,null,null,null,null,null,null,null,null,null,null,{"$f":"NorForm!Y29","v":""},null,{"$f":"NorForm!AB29","v":""},null,{"$f":"TEXT(NorForm!AF29,\"\")  & \"  \" & TEXT(NorForm!AK29,\"\")","v":"  "},null,null,null,null,null,null,null,null,null,null,null,null,{"$f":"NorForm!BD29","v":0},null,{"$f":"NorForm!BG29","v":0},null,null,"Haftalık Toplam",null,null,null,null,null,null,null,null,null,{"$f":"SUM(AR28:BD28)","v":0},null,null,null,null,null,null,null,null,null,null,null,null,null,{"$f":"NorForm!AV51","v":0},null,null,{"$f":"NorForm!BC51","v":0}]
[{"$f":"NorForm!A30 & \" \" &NorForm!F30","v":" "},null,null,null,null,null,null,null,null,null,null,null,null,{"$f":"NorForm!Y30","v":""},null,{"$f":"NorForm!AB30","v":""},null,{"$f":"TEXT(NorForm!AF30,\"\")  & \"  \" & TEXT(NorForm!AK30,\"\")","v":"  "},null,null,null,null,null,null,null,null,null,null,null,null,{"$f":"NorForm!BD30","v":0},null,{"$f":"NorForm!BG30","v":0}]
[{"$f":"NorForm!A31 & \" \" &NorForm!F31","v":" "},null,null,null,null,null,null,null,null,null,null,null,null,{"$f":"NorForm!Y31","v":""},null,{"$f":"NorForm!AB31","v":""},null,{"$f":"TEXT(NorForm!AF31,\"\")  & \"  \" & TEXT(NorForm!AK31,\"\")","v":"  "},null,null,null,null,null,null,null,null,null,null,null,null,{"$f":"NorForm!BD31","v":0},null,{"$f":"NorForm!BG31","v":0},null,null,"Tarih",null,null,null,null,null,null,null,"Teori  Ders",null,null,"Diğer Faaliyetler",null,null,null,null,null,null,null,null,null,null,null,null,null,null,null,"3.Hafta"]
[{"$f":"NorForm!A32 & \" \" &NorForm!F32","v":" "},null,null,null,null,null,null,null,null,null,null,null,null,{"$f":"NorForm!Y32","v":""},null,{"$f":"NorForm!AB32","v":""},null,{"$f":"TEXT(NorForm!AF32,\"\")  & \"  \" & TEXT(NorForm!AK32,\"\")","v":"  "},null,null,null,null,null,null,null,null,null,null,null,null,{"$f":"NorForm!BD32","v":0},null,{"$f":"NorForm!BG32","v":0},null,null,null,null,null,null,null,null,null,null,null,null,"Y.Lisans",null,null,"Staj",null,"Mezuniyet",null,null,"Uygula",null,null,"Ara Sınav",null,null,null,null,null,"ücrete "]
[{"$f":"NorForm!A33 & \" \" &NorForm!F33","v":" "},null,null,null,null,null,null,null,null,null,null,null,null,{"$f":"NorForm!Y33","v":""},null,{"$f":"NorForm!AB33","v":""},null,{"$f":"TEXT(NorForm!AF33,\"\")  & \"  \" & TEXT(NorForm!AK33,\"\")","v":"  "},null,null,null,null,null,null,null,null,null,null,null,null,{"$f":"NorForm!BD33","v":0},null,{"$f":"NorForm!BG33","v":0},null,null,null,null,null,null,null,null,null,null,null,null,"Doktora",null,null,null,null,"Çalışm.",null,null,null,null,null,null,null,null,"Zorunlu",null,null,"tabi"]
[{"$f":"NorForm!A34 & \" \" &NorForm!F34","v":" "},null,null,null,null,null,null,null,null,null,null,null,null,{"$f":"NorForm!Y34","v":""},null,{"$f":"NorForm!AB34","v":""},null,{"$f":"TEXT(NorForm!AF34,\"\")  & \"  \" & TEXT(NorForm!AK34,\"\")","v":"  "},null,null,null,null,null,null,null,null,null,null,null,null,{"$f":"NorForm!BD34","v":0},null,{"$f":"NorForm!BG34","v":0},null,null,"Tüm Dersler",null,null,null,null,null,null,null,{"$f":"NorForm!AP53","v":0},null,null,null,null,null,null,null,null,null,{"$f":"NorForm!AS53","v":0},null,null,{"$f":"NorForm!AS54","v":0},null,null,"Ders",null,null,"ders"]
[{"$f":"NorForm!A35 & \" \" &NorForm!F35","v":" "},null,null,null,null,null,null,null,null,null,null,null,null,{"$f":"NorForm!Y35","v":""},null,{"$f":"NorForm!AB35","v":""},null,{"$f":"TEXT(NorForm!AF35,\"\")  & \"  \" & TEXT(NorForm!AK35,\"\")","v":"  "},null,null,null,null,null,null,null,null,null,null,null,null,{"$f":"NorForm!BD35","v":0},null,{"$f":"NorForm!BG35","v":0},null,null,"Yapılamayan Dersler",null,null,null,null,null,null,null,{"$f":"NorForm!AP55","v":0},null,null,null,null,null,null,null,null,null,{"$f":"NorForm!AS55","v":0},null,null," ",null,null,"Yükü",null,null,"Yükü"]
[{"$f":"NorForm!A36 & \" \" &NorForm!F36","v":" "},null,null,null,null,null,null,null,null,null,null,null,null,{"$f":"NorForm!Y36","v":""},null,{"$f":"NorForm!AB36","v":""},null,{"$f":"TEXT(NorForm!AF36,\"\")  & \"  \" & TEXT(NorForm!AK36,\"\")","v":"  "},null,null,null,null,null,null,null,null,null,null,null,null,{"$f":"NorForm!BD36","v":0},null,{"$f":"NorForm!BG36","v":0},null,null,"Yapılan Dersler",null,null,null,null,null,null,null,{"$f":"NorForm!AP56","v":0},null,null,null,null,null,null,null,null,null,{"$f":"NorForm!AS56","v":0},null,null,null,"(10)*",null,{"$f":"SUM(AT37)-BH37","v":0},null,null,null,"(20)**"]
[null,null,null,null,null,null,null,null,null,null,null,null,null,null,null,null,null,null,null,null,null,null,null,null,null,null,null,null,null,null,null,null,null,null,null,"Haftalık Toplam",null,null,null,null,null,null,null,null,null,{"$f":"SUM(AR36:BD36)","v":0},null,null,null,null,null,null,null,null,null,null,null,null,null,{"$f":"NorForm!AV57","v":0},null,null,{"$f":"NorForm!BC57","v":0}]
[]
[null,null,null,null,null,null,null,null,null,null,null,null,null,null,null,null,null,null,null,null,null,null,null,null,null,null,null,null,null,null,null,null,null,null,null,"Tarih",null,null,null,null,null,null,null,"Teori  Ders",null,null,"Diğer Faaliyetler",null,null,null,null,null,null,null,null,null,null,null,null,null,null,null,"4.Hafta"]
[null,null,null,null,null,null,null,null,null,null,null,null,null,null,null,null,null,null,null,null,null,null,null,null,null,null,null,null,null,null,null,null,null,null,null,null,null,null,null,null,null,null,null,null,null,"Y.Lisans",null,null,"Staj",null,"Mezuniyet",null,null,"Uygula",null,null,"Ara Sınav",null,null,null,null,null,"ücrete "]
[null,null,null,null,null,null,null,null,null,null,null,null,null,null,null,null,null,null,null,null,null,null,null,null,null,null,null,null,null,null,null,null,null,null,null,null,null,null,null,null,null,null,null,null,null,"Doktora",null,null,null,null,"Çalışm.",null,null,null,null,null,null,null,null,"Zorunlu",null,null,"tabi"]
[null,null,null,null,null,null,null,null,null,null,null,null,null,null,null,null,null,null,null,null,null,null,null,null,null,null,null,null,null,null,null,null,null,null,null,"Tüm Dersler",null,null,null,null,null,null,null,{"$f":"NorForm!AP59","v":0},null,null,null,null,null,null,null,null,null,{"$f":"NorForm!AS59","v":0},null,null,{"$f":"NorForm!AS60","v":0},null,null,"Ders",null,null,"ders"]
["Yüksek Lisans Öğrenci Sayısı",null,null,null,null,null,null,null,null,null,null,"Ders",null,null,null,null,null,"Yüksek Lisans Öğrenci Sayısı",null,null,null,null,null,null,null,null,null,null,"Ders",null,null,null,null,null,null,"Yapılamayan Dersler",null,null,null,null,null,null,null,{"$f":"NorForm!AP55","v":0},null,null,null,null,null,null,null,null,null,{"$f":"NorForm!AS61","v":0},null,null,null,null,null,"Yükü",null,null,"Yükü"]
[null,null,null,null,null,null,null,null,null,null,null,"Tez",null,null,null,null,null,null,null,null,null,null,null,null,null,null,null,null,"Tez",null,null,null,null,null,null,"Yapılan Dersler",null,null,null,null,null,null,null,{"$f":"NorForm!AP62","v":0},null,null,null,null,null,null,null,null,null,{"$f":"NorForm!AS62","v":0},null,null,null,"(10)*",null,{"$f":"SUM(AT45)-BH45","v":0},null,null,null,"(20)**"]
["Doktora Öğrenci Sayısı",null,null,null,null,null,null,null,null,null,null,"Ders",null,null,null,null,null,"Doktora Öğrenci Sayısı",null,null,null,null,null,null,null,null,null,null,"Ders",null,null,null,null,null,null,"Haftalık Toplam",null,null,null,null,null,null,null,null,null,{"$f":"SUM(AR44:BD44)","v":0},null,null,null,null,null,null,null,null,null,null,null,null,null,{"$f":"NorForm!AV63","v":0},null,null,{"$f":"NorForm!BC63","v":0}]
[null,null,null,null,null,null,null,null,null,null,null,"Tez",null,null,null,null,null,null,null,null,null,null,null,null,null,null,null,null,"Tez"]
["TOPLAM",null,null,null,null,null,null,null,null,null,null,null,null,{"$f":"SUM(N27:O46)","v":4},null,{"$f":"SUM(P27:Q46)","v":0},null,"TOPLAM",null,null,null,null,null,null,null,null,null,null,null,null,{"$f":"SUM(AE27:AF36)","v":0},null,{"$f":"SUM(AG27:AH46)","v":0},null,null,"Tarih",null,null,null,null,null,null,null,"Teori  Ders",null,null,"Diğer Faaliyetler",null,null,null,null,null,null,null,null,null,null,null,null,null,null,null,"5.Hafta",null,null,null,null,null,null,null,"*",{"$f":"\"  İlgili Öğretim Elemanınca  \" & BV49 & \" \"&  BV50 & BV51 &  \" ayında \" & BV48 &\" toplam** \" & BT55  & \" (\" & sayi(BT55) & \") saat ekders okutulmuş  \"  & \" olup, bunun ***  \" & BK55  & \" (\" & sayi(BK55) & \")  saatinden ücret talep etmektedir. \"","v":"  İlgili Öğretim Elemanınca  Eylül /Ekim ayında 2025 toplam** 4 (Dört) saat ekders okutulmuş   olup, bunun ***  0 ( Sıfır )  saatinden ücret talep etmektedir. "}]
[null,null,null,null,null,null,null,null,null,null,null,null,null,null,null,null,null,null,null,null,null,null,null,null,null,null,null,null,null,null,null,null,null,null,null,null,null,null,null,null,null,null,null,null,null,"Y.Lisans",null,null,"Staj",null,"Mezuniyet",null,null,"Uygula",null,null,"Ara Sınav",null,null,null,null,null,"ücrete ",null,null,null,null,null,null,null,null,{"$f":"NorForm!O72","v":"2025-09-27"},null,{"$f":"TEXT(BT48,\"yyyy\")","v":"2025"}]
["Çizelge 3.  ARA SINAVLAR",null,null,null,null,null,null,null,null,null,null,null,null,null,null,null,null,null,null,null,null,null,null,null,null,null,null,null,null,null,null,null,null,null,null,null,null,null,null,null,null,null,null,null,null,"Doktora",null,null,null,null,"Çalışm.",null,null,null,null,null,null,null,null,"Zorunlu",null,null,"tabi",null,null,null,null,null,null,null,null,{"$f":"'Bilgi-27'!N15","v":"2025-09-27"},null,{"$f":"TEXT(BT49,\"aaaa\")","v":"Eylül"}]
["Dersin Kodu ve Adı",null,null,null,null,null,null,null,null,null,null,null,null,null,null,null,null,null,null,"Sınav Tarihi",null,null,null,null,"Öğrenci Sayısı",null,null,null,null,"Ara Sınav Yükü*",null,null,null,null,null,"Tüm Dersler",null,null,null,null,null,null,null,{"$f":"NorForm!AP65","v":0},null,null,null,null,null,null,null,null,null,{"$f":"NorForm!AS65","v":0},null,null,{"$f":"NorForm!AS66","v":0},null,null,"Ders",null,null,"ders",null,null,null,null,null,null,null,null,{"$f":"IF(BT56=BU56,\"\",\"/\")","v":"/"},null,{"$f":"TEXT(BT50,\"aaaa\")","v":"/"}]
[{"$f":"IF(NorForm!A57<>\"\",NorForm!A57 & \"- \" &NorForm!E57,\"\")","v":""},null,null,null,null,null,null,null,null,null,null,null,null,null,null,null,null,null,{"$f":"NorForm!R57","v":""},null,null,null,null,null,{"$f":"NorForm!W57","v":""},null,null,null,null,{"$f":"IF(Y51<>\"\",IF(Y51>101,3,IF(Y51>51,2,IF(Y51>0,1,\"\"))),\"\")","v":""},null,null,null,null,null,"Yapılamayan Dersler",null,null,null,null,null,null,null,{"$f":"NorForm!AP67","v":0},null,null,null,null,null,null,null,null,null,{"$f":"NorForm!AS67","v":0},null,null,null,null,null,"Yükü",null,null,"Yükü",null,null,null,null,null,null,null,null,{"$f":"IF(NorForm!R70=NorForm!U70,\"\",'Bilgi-27'!T15)","v":"2025-10-01"},null,{"$f":"TEXT(BT51,\"aaaa\")","v":"Ekim"}]
[{"$f":"IF(NorForm!A58<>\"\",NorForm!A58 & \"- \" &NorForm!E58,\"\")","v":""},null,null,null,null,null,null,null,null,null,null,null,null,null,null,null,null,null,{"$f":"NorForm!R58","v":""},null,null,null,null,null,{"$f":"NorForm!W58","v":""},null,null,null,null,{"$f":"IF(Y52<>\"\",IF(Y52>101,3,IF(Y52>51,2,IF(Y52>0,1,\"\"))),\"\")","v":""},null,null,null,null,null,"Yapılan Dersler",null,null,null,null,null,null,null,{"$f":"NorForm!AP68","v":0},null,null,null,null,null,null,null,null,null,{"$f":"NorForm!AS68","v":0},null,null,null,"(10)*",null,{"$f":"SUM(AT53)-BH53","v":0},null,null,null,"(20)**"]
[{"$f":"IF(NorForm!A59<>\"\",NorForm!A59 & \"- \" &NorForm!E59,\"\")","v":""},null,null,null,null,null,null,null,null,null,null,null,null,null,null,null,null,null,{"$f":"NorForm!R59","v":""},null,null,null,null,null,{"$f":"NorForm!W59","v":""},null,null,null,null,"",null,null,null,null,null,"Haftalık Toplam",null,null,null,null,null,null,null,null,null,{"$f":"SUM(AR52:BD52)","v":0},null,null,null,null,null,null,null,null,null,null,null,null,null,{"$f":"NorForm!AV69","v":0},null,null,{"$f":"NorForm!BC69","v":0}]
[{"$f":"IF(NorForm!A60<>\"\",NorForm!A60 & \"- \" &NorForm!E60,\"\")","v":""},null,null,null,null,null,null,null,null,null,null,null,null,null,null,null,null,null,{"$f":"NorForm!R60","v":""},null,null,null,null,null,{"$f":"NorForm!W60","v":""},null,null,null,null,""]
[{"$f":"IF(NorForm!A61<>\"\",NorForm!A61 & \"- \" &NorForm!E61,\"\")","v":""},null,null,null,null,null,null,null,null,null,null,null,null,null,null,null,null,null,{"$f":"NorForm!R61","v":""},null,null,null,null,null,{"$f":"NorForm!W61","v":""},null,null,null,null,"",null,null,null,null,null,"AYLIK ÜCRETE TABİ DERS YÜKÜ (SAAT)",null,null,null,null,null,null,null,null,null,null,null,null,null,null,null,null,null,null,null,null,null,null,null,null,null,null,{"$f":"SUM(BK21,BK29,BK37,BK45,BK53)","v":0},null,null,null,null,null,null,null,null,{"$f":"SUM(AT21,AT29,AT37,AT45,AT53)","v":4}]
[{"$f":"IF(NorForm!A62<>\"\",NorForm!A62 & \"- \" &NorForm!E62,\"\")","v":""},null,null,null,null,null,null,null,null,null,null,null,null,null,null,null,null,null,{"$f":"NorForm!R62","v":""},null,null,null,null,null,{"$f":"NorForm!W62","v":""},null,null,null,null,"",null,null,null,null,null,null,null,null,null,null,null,null,null,null,null,null,null,null,null,null,null,null,null,null,null,null,null,null,null,null,null,null,null,null,null,null,null,null,null,null,null,{"$f":"MONTH('Bilgi-27'!N15)","v":9},{"$f":"MONTH('Bilgi-27'!T15)","v":10}]
[{"$f":"IF(NorForm!A63<>\"\",NorForm!A63 & \"- \" &NorForm!E63,\"\")","v":""},null,null,null,null,null,null,null,null,null,null,null,null,null,null,null,null,null,{"$f":"NorForm!R63","v":""},null,null,null,null,null,{"$f":"NorForm!W63","v":""},null,null,null,null,"",null,null,null,null,null,{"$f":"BT47","v":"  İlgili Öğretim Elemanınca  Eylül /Ekim ayında 2025 toplam** 4 (Dört) saat ekders okutulmuş   olup, bunun ***  0 ( Sıfır )  saatinden ücret talep etmektedir. "}]
[{"$f":"IF(NorForm!A64<>\"\",NorForm!A64 & \"- \" &NorForm!E64,\"\")","v":""},null,null,null,null,null,null,null,null,null,null,null,null,null,null,null,null,null,{"$f":"NorForm!R64","v":""},null,null,null,null,null,{"$f":"NorForm!W64","v":""},null,null,null,null,""]
[{"$f":"IF(NorForm!A65<>\"\",NorForm!A65 & \"- \" &NorForm!E65,\"\")","v":""},null,null,null,null,null,null,null,null,null,null,null,null,null,null,null,null,null,{"$f":"NorForm!R65","v":""},null,null,null,null,null,{"$f":"NorForm!W65","v":""},null,null,null,null,""]
[{"$f":"IF(NorForm!A66<>\"\",NorForm!A66 & \"- \" &NorForm!E66,\"\")","v":""},null,null,null,null,null,null,null,null,null,null,null,null,null,null,null,null,null,null,"T O P L A M",null,null,null,null,null,null,null,null,null,{"$f":"SUM(AD51:AH59)","v":0}]
["* Öğrenci Sayısına Göre : 1-50: 1, 51-100: 2, 101-150: 3, ……….",null,null,null,null,null,null,null,null,null,null,null,null,null,null,null,null,null,null,null,null,null,null,null,null,null,null,null,null,null,null,null,null,null,null,"* Diğer Faaliyetler toplamı 10'u geçmez, geçerse yalnız 10 saati esas alınır."]
["Çizelge 4. YAPILAMAYAN DERSLER",null,null,null,null,null,null,null,null,null,null,null,null,null,null,null,null,null,null,null,null,null,null,null,null,null,null,null,null,null,null,null,null,null,null,"** Ücrete Tabi haftalık yük toplamı 20'yi geçmez geçerse 20 saati esas alınır."]
["Yapılamayan Günler",null,null,null,null,null,null,null,null,null,null,null,null,null,null,null,null,null," Ders Saati",null,null,null,null,null,"Hafta",null,null,null,null,null,null,null,null,null,null,"*** Yazıyla doldurulacaktır."]
[null,null,null,null,null,null,null,null,null,null,null,null,null,null,null,null," Teorik",null,null,null," Diğer"]
[{"$f":"IF(NorForm!A41<>\"\",NorForm!A41 & \" - \" & NorForm!F41,\"\")","v":""},null,null,null,null,null,null,null,null,null,null,null,null,null,null,null,{"$f":"NorForm!T41","v":""},null,null,null,{"$f":"NorForm!W41","v":""},null,null,null,{"$f":"NorForm!Z41","v":0},null,null,null,null,null,null,null,null,null,null,"  Bildiri sahibinin adı soyadı imzası",null,null,null,null,null,null,null,null,null,null,null,"Bölüm Başkanı",null,null,null,null,null,null,null,null,null,"Onay "]
[{"$f":"IF(NorForm!A42<>\"\",NorForm!A42 & \" - \" & NorForm!F42,\"\")","v":""},null,null,null,null,null,null,null,null,null,null,null,null,null,null,null,{"$f":"NorForm!T42","v":""},null,null,null,{"$f":"NorForm!W42","v":""},null,null,null,{"$f":"NorForm!Z42","v":0}]
[{"$f":"IF(NorForm!A43<>\"\",NorForm!A43 & \" - \" & NorForm!F43,\"\")","v":""},null,null,null,null,null,null,null,null,null,null,null,null,null,null,null,{"$f":"NorForm!T43","v":""},null,null,null,{"$f":"NorForm!W43","v":""},null,null,null,{"$f":"NorForm!Z43","v":0}]
[{"$f":"IF(NorForm!A44<>\"\",NorForm!A44 & \" - \" & NorForm!F44,\"\")","v":""},null,null,null,null,null,null,null,null,null,null,null,null,null,null,null,{"$f":"NorForm!T44","v":""},null,null,null,{"$f":"NorForm!W44","v":""},null,null,null,{"$f":"NorForm!Z44","v":0}]
[{"$f":"IF(NorForm!A45<>\"\",NorForm!A45 & \" - \" & NorForm!F45,\"\")","v":""},null,null,null,null,null,null,null,null,null,null,null,null,null,null,null,{"$f":"NorForm!T45","v":""},null,null,null,{"$f":"NorForm!W45","v":""},null,null,null,{"$f":"NorForm!Z45","v":0},null,null,null,null,null,null,null,null,null,null,null,{"$f":"D8 & \" \" & Q8","v":"Öğr.Gör. Celalettin AYDIN"},null,null,null,null,null,null,null,null,{"$f":"'Bilgi-27'!Z13","v":"Ögr. Gör. Celalettin AYDIN"},null,null,null,null,null,null,null,null,null,null,{"$f":"'Bilgi-27'!Z12","v":"Prof. Dr. Mutlu AVCI"}]
[{"$f":"IF(NorForm!A46<>\"\",NorForm!A46 & \" - \" & NorForm!F46,\"\")","v":""},null,null,null,null,null,null,null,null,null,null,null,null,null,null,null,{"$f":"NorForm!T46","v":""},null,null,null,{"$f":"NorForm!W46","v":""},null,null,null,{"$f":"NorForm!Z46","v":0},null,null,null,null,null,null,null,null,null,null,null,null,null,null,null,null,null,null,null,null,null,null,null,null,null,null,null,null,null,null,null,{"$f":"'Bilgi-27'!Z11","v":"Müdür"}]
[{"$f":"IF(NorForm!A47<>\"\",NorForm!A47 & \" - \" & NorForm!F47,\"\")","v":""},null,null,null,null,null,null,null,null,null,null,null,null,null,null,null,{"$f":"NorForm!T47","v":""},null,null,null,{"$f":"NorForm!W47","v":""},null,null,null,{"$f":"NorForm!Z47","v":0}]
[null,null,null,"TOPLAM",null,null,null,null,null,null,null,null,null,null,null,null,{"$f":"SUM(Q65:T71)","v":0},null,null,null,{"$f":"SUM(U65:X71)","v":0}]
[]
[]
[null,null,null,"HAZIRLAYAN",null,null,null,null,null,null,null,"KONTROL EDEN",null,null,null,null,null,null,"ONAYLAYAN"]

{"sheet":"IOGIRIS","index":6,"n_rows":60,"n_cols":69,"rows_kept":60,"cut":false,"hidden":false,"merged":[[19,54,19,61],[46,1,46,6],[46,7,46,16],[47,1,47,6],[47,7,47,16],[12,43,12,47],[11,33,11,37],[10,33,10,37],[11,48,11,52],[12,48,12,52],[44,45,44,48],[44,49,44,52],[38,49,38,52],[39,53,39,56],[39,49,39,52],[38,53,38,56],[37,32,37,44],[37,45,37,48],[37,49,37,52],[36,53,36,56],[36,32,36,44],[36,45,36,48],[36,49,36,52],[37,53,37,56],[0,5,0,45],[45,28,45,52],[45,53,45,56],[45,1,45,19],[45,20,45,21],[45,22,45,23],[45,24,45,26],[44,53,44,56],[43,1,43,4],[43,5,43,19],[43,20,43,21],[43,22,43,23],[43,24,43,26],[43,53,43,56],[43,49,43,52],[43,28,43,31],[43,32,43,44],[43,45,43,48],[42,53,42,56],[42,49,42,52],[42,28,42,31],[44,24,44,26],[44,28,44,31],[44,32,44,44],[44,1,44,4],[44,5,44,19],[44,20,44,21],[44,22,44,23],[42,32,42,44],[42,45,42,48],[42,1,42,4],[42,5,42,19],[42,20,42,21],[42,22,42,23],[42,24,42,26],[40,49,40,52],[41,53,41,56],[40,1,40,4],[40,5,40,19],[40,20,40,21],[40,22,40,23],[40,24,40,26],[41,28,41,31],[41,32,41,44],[41,45,41,48],[41,49,41,52],[40,53,40,56],[41,1,41,4],[41,5,41,19],[41,20,41,21],[41,22,41,23],[41,24,41,26],[40,28,40,31],[40,32,40,44],[40,45,40,48],[38,28,38,31],[38,32,38,44],[38,45,38,48],[38,1,38,4],[38,5,38,19],[38,20,38,21],[38,22,38,23],[38,24,38,26],[39,28,39,31],[39,32,39,44],[39,45,39,48],[39,1,39,4],[39,5,39,19],[39,20,39,21],[39,22,39,23],[39,24,39,26],[37,1,37,4],[37,5,37,19],[37,20,37,21],[37,22,37,23],[37,24,37,26],[36,28,36,31],[36,24,36,26],[35,24,35,26],[37,28,37,31],[35,1,35,4],[35,5,35,19],[35,20,35,21],[36,1,36,4],[36,5,36,19],[36,20,36,21],[35,22,35,23],[36,22,36,23],[35,28,35,31],[35,53,35,56],[34,53,34,56],[29,50,29,51],[33,1,33,26],[34,1,34,19],[34,20,34,21],[34,49,34,52],[34,24,34,26],[34,28,34,44],[34,45,34,48],[31,22,31,23],[30,1,30,4],[30,5,30,19],[30,20,30,21],[31,1,31,19],[31,20,31,21],[30,28,30,31],[30,32,30,47],[30,22,30,23],[29,1,29,4],[29,48,29,49],[35,32,35,44],[35,45,35,48],[35,49,35,52],[29,5,29,19],[34,22,34,23],[29,20,29,21],[29,22,29,23],[29,28,29,31],[29,32,29,47],[26,50,26,51],[27,28,27,31],[27,32,27,47],[27,48,27,49],[27,50,27,51],[26,28,26,31],[28,50,28,51],[26,32,26,47],[26,48,26,49],[28,28,28,31],[28,32,28,47],[28,48,28,49],[31,50,31,51],[33,28,33,56],[31,28,31,47],[30,48,30,49],[30,50,30,51],[31,48,31,49],[27,1,27,4],[27,5,27,19],[27,20,27,21],[27,22,27,23],[26,1,26,4],[26,5,26,19],[26,20,26,21],[28,1,28,4],[28,5,28,19],[26,22,26,23],[28,20,28,21],[28,22,28,23],[24,50,24,51],[25,1,25,4],[25,5,25,19],[25,20,25,21],[25,22,25,23],[25,28,25,31],[25,32,25,47],[25,48,25,49],[25,50,25,51],[24,1,24,4],[24,5,24,19],[24,20,24,21],[24,22,24,23],[24,28,24,31],[24,32,24,47],[23,1,23,4],[23,5,23,19],[23,20,23,21],[23,22,23,23],[22,1,22,4],[22,5,22,19],[22,20,22,21],[22,22,22,23],[24,48,24,49],[22,48,22,49],[22,50,22,51],[23,28,23,31],[23,32,23,47],[23,48,23,49],[23,50,23,51],[22,28,22,31],[22,32,22,47],[17,8,17,12],[20,5,20,19],[21,48,21,49],[21,50,21,51],[17,18,17,22],[17,43,17,47],[21,1,21,4],[21,5,21,19],[21,20,21,21],[21,22,21,23],[21,28,21,31],[21,32,21,47],[20,20,20,21],[20,22,20,23],[20,28,20,31],[20,32,20,47],[16,18,16,22],[16,23,16,27],[16,28,16,32],[17,23,17,27],[17,28,17,32],[17,33,17,37],[17,38,17,42],[20,48,20,49],[17,48,17,52],[20,50,20,51],[19,1,19,23],[19,28,19,51],[20,1,20,4],[16,1,17,4],[17,13,17,17],[17,5,17,7],[16,5,16,7],[16,8,16,12],[16,13,16,17],[16,43,16,47],[16,48,16,52],[16,33,16,37],[16,38,16,42],[15,13,15,17],[15,38,15,42],[15,43,15,47],[15,18,15,22],[15,23,15,27],[15,28,15,32],[14,23,14,27],[14,28,14,32],[15,33,15,37],[14,18,14,22],[14,33,14,37],[14,38,14,42],[15,48,15,52],[14,48,14,52],[12,28,12,32],[13,13,13,17],[13,18,13,22],[13,48,13,52],[14,1,15,4],[14,5,14,7],[14,8,14,12],[14,13,14,17],[13,28,13,32],[13,43,13,47],[13,5,13,7],[13,8,13,12],[14,43,14,47],[13,33,13,37],[13,38,13,42],[13,23,13,27],[12,1,13,4],[12,33,12,37],[12,38,12,42],[15,5,15,7],[15,8,15,12],[12,23,12,27],[8,5,8,7],[8,8,8,12],[8,13,8,17],[9,23,9,27],[8,23,8,27],[11,13,11,17],[11,18,11,22],[8,1,9,4],[8,18,8,22],[11,5,11,7],[11,23,11,27],[10,23,10,27],[11,8,11,12],[12,13,12,17],[12,18,12,22],[12,5,12,7],[12,8,12,12],[9,43,9,47],[9,5,9,7],[9,8,9,12],[9,13,9,17],[10,1,11,4],[10,5,10,7],[10,8,10,12],[10,13,10,17],[10,18,10,22],[11,38,11,42],[10,38,10,42],[11,43,11,47],[10,28,10,32],[10,48,10,52],[10,43,10,47],[11,28,11,32],[9,28,9,32],[9,33,9,37],[9,48,9,52],[7,8,7,12],[7,13,7,17],[7,18,7,22],[7,23,7,27],[7,28,7,32],[8,38,8,42],[8,43,8,47],[8,48,8,52],[8,33,8,37],[8,28,8,32],[9,18,9,22],[9,38,9,42],[6,48,7,52],[1,39,1,48],[2,39,2,48],[3,1,3,7],[3,8,3,12],[3,29,3,35],[3,36,3,48],[7,33,7,37],[7,38,7,42],[7,43,7,47],[7,1,7,7],[2,8,2,12],[2,14,2,18],[2,29,2,38],[4,1,4,7],[4,8,4,20],[2,1,2,7],[4,22,4,28],[1,1,1,7],[1,8,1,27],[1,29,1,38],[6,1,6,47]]}
[null,null,null,null,null,{"$f":"'Bilgi-27'!K51","v":"Bu Program  Öğr.Gör. Celalettin AYDIN (Ç.Ü. CEYHAN MYO) Tarafindan Yapilmistir."}]
[null,"KURUM",null,null,null,null,null,null,{"$f":"'Bilgi-27'!Z6","v":"Ç.Ü. CEyhan Meslek Yüksekokulu"},null,null,null,null,null,null,null,null,null,null,null,null,null,null,null,null,null,null,null,null,"İDARİ GÖREVİ",null,null,null,null,null,null,null,null,null,{"$f":"F1form!L8","v":0}]
[null,"DÖNEM TARİH",null,null,null,null,null,null,{"$f":"NorGiris!I3","v":"2025-09-27"},null,null,null,null,"-",{"$f":"IF($I$4=1,$I$3+4,IF($I$4=2,$I$3+11,IF($I$4=3,$I$3+18,IF($I$4=4,$I$3+25,IF($I$4=5,$I$3+32,0)))))","v":"2025-10-01"},null,null,null,null,null,null,null,null,null,null,null,null,null,null,"ZORUNLU DERS YÜKÜ",null,null,null,null,null,null,null,null,null,{"$f":"F1form!P45","v":0}]
[null,"HAFTA SAYISI",null,null,null,null,null,null,{"$f":"NorGiris!I4","v":1},null,null,null,null,null,null,null,null,null,null,null,null,null,null,null,null,null,null,null,null,"BÖLÜMÜ",null,null,null,null,null,null,{"$f":"NorGiris!AK4","v":"Bilgisayar Bölümü"}]
[null,"ADI SOYADI",null,null,null,null,null,null,{"$f":"F1form!E8","v":"Öğr.Gör. Celalettin AYDIN"},null,null,null,null,null,null,null,null,null,null,null,null,null,"İkinci Öğretim"]
[]
[null,"Haftalık Ders Programı",null,null,null,null,null,null,null,null,null,null,null,null,null,null,null,null,null,null,null,null,null,null,null,null,null,null,null,null,null,null,null,null,null,null,null,null,null,null,null,null,null,null,null,null,null,null,null,null,null,null,null,null,null,null,null,null,"TOPLAM"]
[null,"Günler",null,null,null,null,null,null,{"$f":"'Bilgi-27'!I34:M34","v":"13:00-13:45"},null,null,null,null,{"$f":"'Bilgi-27'!N34:R34","v":"14:00-14:45"},null,null,null,null,{"$f":"'Bilgi-27'!S34:W34","v":"15:00-14:45"},null,null,null,null,{"$f":"'Bilgi-27'!X34:AB34","v":"16:00-16:45"},null,null,null,null,{"$f":"'Bilgi-27'!AC34:AG34","v":"17:00-17:45"},null,null,null,null,{"$f":"'Bilgi-27'!AH34:AL34","v":"18:00-1845"},null,null,null,null,{"$f":"'Bilgi-27'!AM34:AQ34","v":"19:00-19:45"},null,null,null,null,{"$f":"'Bilgi-27'!AR34:AV34","v":"20:00-20:45"},null,null,null,null,{"$f":"'Bilgi-27'!AW34:BA34","v":"21:00-21:45"},null,null,null,null,{"$f":"'Bilgi-27'!BB34:BF34","v":"22:00-22:45"}]
[null,"Pazartesi",null,null,null,"Teorik",null,null,{"$f":"IF('Bilgi-27'!I35:M35<>\"\",'Bilgi-27'!I35:M35,0)","v":0},null,null,null,null,{"$f":"IF('Bilgi-27'!N35:R35<>\"\",'Bilgi-27'!N35:R35,0)","v":0},null,null,null,null,{"$f":"IF('Bilgi-27'!S35:W35<>\"\",'Bilgi-27'!S35:W35,0)","v":0},null,null,null,null,{"$f":"IF('Bilgi-27'!X35:AB35<>\"\",'Bilgi-27'!X35:AB35,0)","v":0},null,null,null,null,{"$f":"IF('Bilgi-27'!AC35:AG35<>\"\",'Bilgi-27'!AC35:AG35,0)","v":0},null,null,null,null,{"$f":"IF('Bilgi-27'!AH35:AL35<>\"\",'Bilgi-27'!AH35:AL35,0)","v":0},null,null,null,null,{"$f":"IF('Bilgi-27'!AM35:AQ35<>\"\",'Bilgi-27'!AM35:AQ35,0)","v":0},null,null,null,null,{"$f":"IF('Bilgi-27'!AR35:AV35<>\"\",'Bilgi-27'!AR35:AV35,0)","v":0},null,null,null,null,{"$f":"IF('Bilgi-27'!AW35:BA35<>\"\",'Bilgi-27'!AW35:BA35,0)","v":0},null,null,null,null,{"$f":"IF('Bilgi-27'!BB35:BF35<>\"\",'Bilgi-27'!BB35:BF35,0)","v":0},null,null,null,null,{"$f":"'Bilgi-27'!BG35","v":0}]
[null,null,null,null,null,"Diğer f.",null,null,{"$f":"IF('Bilgi-27'!I36:M36<>\"\",'Bilgi-27'!I36:M36,0)","v":0},null,null,null,null,{"$f":"IF('Bilgi-27'!N36:R36<>\"\",'Bilgi-27'!N36:R36,0)","v":0},null,null,null,null,{"$f":"IF('Bilgi-27'!S36:W36<>\"\",'Bilgi-27'!S36:W36,0)","v":0},null,null,null,null,{"$f":"IF('Bilgi-27'!X36:AB36<>\"\",'Bilgi-27'!X36:AB36,0)","v":0},null,null,null,null,{"$f":"IF('Bilgi-27'!AC36:AG36<>\"\",'Bilgi-27'!AC36:AG36,0)","v":0},null,null,null,null,{"$f":"IF('Bilgi-27'!AH36:AL36<>\"\",'Bilgi-27'!AH36:AL36,0)","v":0},null,null,null,null,{"$f":"IF('Bilgi-27'!AM36:AQ36<>\"\",'Bilgi-27'!AM36:AQ36,0)","v":0},null,null,null,null,{"$f":"IF('Bilgi-27'!AR36:AV36<>\"\",'Bilgi-27'!AR36:AV36,0)","v":0},null,null,null,null,{"$f":"IF('Bilgi-27'!AW36:BA36<>\"\",'Bilgi-27'!AW36:BA36,0)","v":0},null,null,null,null,{"$f":"IF('Bilgi-27'!BB36:BF36<>\"\",'Bilgi-27'!BB36:BF36,0)","v":0},null,null,null,null,{"$f":"'Bilgi-27'!BG36","v":0}]
[null,"Salı",null,null,null,"Teorik",null,null,{"$f":"IF('Bilgi-27'!I37:M37<>\"\",'Bilgi-27'!I37:M37,0)","v":0},null,null,null,null,{"$f":"IF('Bilgi-27'!N37:R37<>\"\",'Bilgi-27'!N37:R37,0)","v":0},null,null,null,null,{"$f":"IF('Bilgi-27'!S37:W37<>\"\",'Bilgi-27'!S37:W37,0)","v":0},null,null,null,null,{"$f":"IF('Bilgi-27'!X37:AB37<>\"\",'Bilgi-27'!X37:AB37,0)","v":0},null,null,null,null,{"$f":"IF('Bilgi-27'!AC37:AG37<>\"\",'Bilgi-27'!AC37:AG37,0)","v":0},null,null,null,null,{"$f":"IF('Bilgi-27'!AH37:AL37<>\"\",'Bilgi-27'!AH37:AL37,0)","v":0},null,null,null,null,{"$f":"IF('Bilgi-27'!AM37:AQ37<>\"\",'Bilgi-27'!AM37:AQ37,0)","v":0},null,null,null,null,{"$f":"IF('Bilgi-27'!AR37:AV37<>\"\",'Bilgi-27'!AR37:AV37,0)","v":0},null,null,null,null,{"$f":"IF('Bilgi-27'!AW37:BA37<>\"\",'Bilgi-27'!AW37:BA37,0)","v":0},null,null,null,null,{"$f":"IF('Bilgi-27'!BB37:BF37<>\"\",'Bilgi-27'!BB37:BF37,0)","v":0},null,null,null,null,{"$f":"'Bilgi-27'!BG37","v":0}]
[null,null,null,null,null,"Diğer f.",null,null,{"$f":"IF('Bilgi-27'!I38:M38<>\"\",'Bilgi-27'!I38:M38,0)","v":0},null,null,null,null,{"$f":"IF('Bilgi-27'!N38:R38<>\"\",'Bilgi-27'!N38:R38,0)","v":0},null,null,null,null,{"$f":"IF('Bilgi-27'!S38:W38<>\"\",'Bilgi-27'!S38:W38,0)","v":0},null,null,null,null,{"$f":"IF('Bilgi-27'!X38:AB38<>\"\",'Bilgi-27'!X38:AB38,0)","v":0},null,null,null,null,{"$f":"IF('Bilgi-27'!AC38:AG38<>\"\",'Bilgi-27'!AC38:AG38,0)","v":0},null,null,null,null,{"$f":"IF('Bilgi-27'!AH38:AL38<>\"\",'Bilgi-27'!AH38:AL38,0)","v":0},null,null,null,null,{"$f":"IF('Bilgi-27'!AM38:AQ38<>\"\",'Bilgi-27'!AM38:AQ38,0)","v":0},null,null,null,null,{"$f":"IF('Bilgi-27'!AR38:AV38<>\"\",'Bilgi-27'!AR38:AV38,0)","v":0},null,null,null,null,{"$f":"IF('Bilgi-27'!AW38:BA38<>\"\",'Bilgi-27'!AW38:BA38,0)","v":0},null,null,null,null,{"$f":"IF('Bilgi-27'!BB38:BF38<>\"\",'Bilgi-27'!BB38:BF38,0)","v":0},null,null,null,null,{"$f":"'Bilgi-27'!BG38","v":0}]
[null,"Çarşamba",null,null,null,"Teorik",null,null,{"$f":"IF('Bilgi-27'!I39:M39<>\"\",'Bilgi-27'!I39:M39,0)","v":0},null,null,null,null,{"$f":"IF('Bilgi-27'!N39:R39<>\"\",'Bilgi-27'!N39:R39,0)","v":0},null,null,null,null,{"$f":"IF('Bilgi-27'!S39:W39<>\"\",'Bilgi-27'!S39:W39,0)","v":0},null,null,null,null,{"$f":"IF('Bilgi-27'!X39:AB39<>\"\",'Bilgi-27'!X39:AB39,0)","v":0},null,null,null,null,{"$f":"IF('Bilgi-27'!AC39:AG39<>\"\",'Bilgi-27'!AC39:AG39,0)","v":0},null,null,null,null,{"$f":"IF('Bilgi-27'!AH39:AL39<>\"\",'Bilgi-27'!AH39:AL39,0)","v":0},null,null,null,null,{"$f":"IF('Bilgi-27'!AM39:AQ39<>\"\",'Bilgi-27'!AM39:AQ39,0)","v":0},null,null,null,null,{"$f":"IF('Bilgi-27'!AR39:AV39<>\"\",'Bilgi-27'!AR39:AV39,0)","v":0},null,null,null,null,{"$f":"IF('Bilgi-27'!AW39:BA39<>\"\",'Bilgi-27'!AW39:BA39,0)","v":0},null,null,null,null,{"$f":"IF('Bilgi-27'!BB39:BF39<>\"\",'Bilgi-27'!BB39:BF39,0)","v":0},null,null,null,null,{"$f":"'Bilgi-27'!BG39","v":0},null,null,null,null,null,null,null,null,{"$f":"SUM(I9,N9,S9,X9,I11,N11,S11,X11,I13,N13,S13,X13,I15,N15,S15,X15,I17,N17,S17,X17)","v":0}]
[null,null,null,null,null,"Diğer f.",null,null,{"$f":"IF('Bilgi-27'!I40:M40<>\"\",'Bilgi-27'!I40:M40,0)","v":0},null,null,null,null,{"$f":"IF('Bilgi-27'!N40:R40<>\"\",'Bilgi-27'!N40:R40,0)","v":0},null,null,null,null,{"$f":"IF('Bilgi-27'!S40:W40<>\"\",'Bilgi-27'!S40:W40,0)","v":0},null,null,null,null,{"$f":"IF('Bilgi-27'!X40:AB40<>\"\",'Bilgi-27'!X40:AB40,0)","v":0},null,null,null,null,{"$f":"IF('Bilgi-27'!AC40:AG40<>\"\",'Bilgi-27'!AC40:AG40,0)","v":0},null,null,null,null,{"$f":"IF('Bilgi-27'!AH40:AL40<>\"\",'Bilgi-27'!AH40:AL40,0)","v":0},null,null,null,null,{"$f":"IF('Bilgi-27'!AM40:AQ40<>\"\",'Bilgi-27'!AM40:AQ40,0)","v":0},null,null,null,null,{"$f":"IF('Bilgi-27'!AR40:AV40<>\"\",'Bilgi-27'!AR40:AV40,0)","v":0},null,null,null,null,{"$f":"IF('Bilgi-27'!AW40:BA40<>\"\",'Bilgi-27'!AW40:BA40,0)","v":0},null,null,null,null,{"$f":"IF('Bilgi-27'!BB40:BF40<>\"\",'Bilgi-27'!BB40:BF40,0)","v":0},null,null,null,null,{"$f":"'Bilgi-27'!BG40","v":0}]
[null,"Perşembe",null,null,null,"Teorik",null,null,{"$f":"IF('Bilgi-27'!I41:M41<>\"\",'Bilgi-27'!I41:M41,0)","v":0},null,null,null,null,{"$f":"IF('Bilgi-27'!N41:R41<>\"\",'Bilgi-27'!N41:R41,0)","v":0},null,null,null,null,{"$f":"IF('Bilgi-27'!S41:W41<>\"\",'Bilgi-27'!S41:W41,0)","v":0},null,null,null,null,{"$f":"IF('Bilgi-27'!X41:AB41<>\"\",'Bilgi-27'!X41:AB41,0)","v":0},null,null,null,null,{"$f":"IF('Bilgi-27'!AC41:AG41<>\"\",'Bilgi-27'!AC41:AG41,0)","v":0},null,null,null,null,{"$f":"IF('Bilgi-27'!AH41:AL41<>\"\",'Bilgi-27'!AH41:AL41,0)","v":0},null,null,null,null,{"$f":"IF('Bilgi-27'!AM41:AQ41<>\"\",'Bilgi-27'!AM41:AQ41,0)","v":0},null,null,null,null,{"$f":"IF('Bilgi-27'!AR41:AV41<>\"\",'Bilgi-27'!AR41:AV41,0)","v":0},null,null,null,null,{"$f":"IF('Bilgi-27'!AW41:BA41<>\"\",'Bilgi-27'!AW41:BA41,0)","v":0},null,null,null,null,{"$f":"IF('Bilgi-27'!BB41:BF41<>\"\",'Bilgi-27'!BB41:BF41,0)","v":0},null,null,null,null,{"$f":"'Bilgi-27'!BG41","v":0}]
[null,null,null,null,null,"Diğer f.",null,null,{"$f":"IF('Bilgi-27'!I42:M42<>\"\",'Bilgi-27'!I42:M42,0)","v":0},null,null,null,null,{"$f":"IF('Bilgi-27'!N42:R42<>\"\",'Bilgi-27'!N42:R42,0)","v":0},null,null,null,null,{"$f":"IF('Bilgi-27'!S42:W42<>\"\",'Bilgi-27'!S42:W42,0)","v":0},null,null,null,null,{"$f":"IF('Bilgi-27'!X42:AB42<>\"\",'Bilgi-27'!X42:AB42,0)","v":0},null,null,null,null,{"$f":"IF('Bilgi-27'!AC42:AG42<>\"\",'Bilgi-27'!AC42:AG42,0)","v":0},null,null,null,null,{"$f":"IF('Bilgi-27'!AH42:AL42<>\"\",'Bilgi-27'!AH42:AL42,0)","v":0},null,null,null,null,{"$f":"IF('Bilgi-27'!AM42:AQ42<>\"\",'Bilgi-27'!AM42:AQ42,0)","v":0},null,null,null,null,{"$f":"IF('Bilgi-27'!AR42:AV42<>\"\",'Bilgi-27'!AR42:AV42,0)","v":0},null,null,null,null,{"$f":"IF('Bilgi-27'!AW42:BA42<>\"\",'Bilgi-27'!AW42:BA42,0)","v":0},null,null,null,null,{"$f":"IF('Bilgi-27'!BB42:BF42<>\"\",'Bilgi-27'!BB42:BF42,0)","v":0},null,null,null,null,{"$f":"'Bilgi-27'!BG42","v":0},null,null,null,null,null,null,null,null,"ikili","Aksam"]
[null,"Cuma",null,null,null,"Teorik",null,null,{"$f":"IF('Bilgi-27'!I43:M43<>\"\",'Bilgi-27'!I43:M43,0)","v":0},null,null,null,null,{"$f":"IF('Bilgi-27'!N43:R43<>\"\",'Bilgi-27'!N43:R43,0)","v":0},null,null,null,null,{"$f":"IF('Bilgi-27'!S43:W43<>\"\",'Bilgi-27'!S43:W43,0)","v":0},null,null,null,null,{"$f":"IF('Bilgi-27'!X43:AB43<>\"\",'Bilgi-27'!X43:AB43,0)","v":0},null,null,null,null,{"$f":"IF('Bilgi-27'!AC43:AG43<>\"\",'Bilgi-27'!AC43:AG43,0)","v":0},null,null,null,null,{"$f":"IF('Bilgi-27'!AH43:AL43<>\"\",'Bilgi-27'!AH43:AL43,0)","v":0},null,null,null,null,{"$f":"IF('Bilgi-27'!AM43:AQ43<>\"\",'Bilgi-27'!AM43:AQ43,0)","v":0},null,null,null,null,{"$f":"IF('Bilgi-27'!AR43:AV43<>\"\",'Bilgi-27'!AR43:AV43,0)","v":0},null,null,null,null,{"$f":"IF('Bilgi-27'!AW43:BA43<>\"\",'Bilgi-27'!AW43:BA43,0)","v":0},null,null,null,null,{"$f":"IF('Bilgi-27'!BB43:BF43<>\"\",'Bilgi-27'!BB43:BF43,0)","v":0},null,null,null,null,{"$f":"'Bilgi-27'!BG43","v":0},null,null,null,null,null,{"$f":"SUM(BG17:BL17,BG15,BG13,BG11,BG9)","v":0},{"$f":"SUM(BG18,BG16,BG14,BG12,BG10)","v":0},null,{"$f":"40-COUNTIF(I9:AB18,0)","v":0},{"$f":"60-COUNTIF(AC9:BF18,0)","v":0}]
[null,null,null,null,null,"Diğer f.",null,null,{"$f":"IF('Bilgi-27'!I44:M44<>\"\",'Bilgi-27'!I44:M44,0)","v":0},null,null,null,null,{"$f":"IF('Bilgi-27'!N44:R44<>\"\",'Bilgi-27'!N44:R44,0)","v":0},null,null,null,null,{"$f":"IF('Bilgi-27'!S44:W44<>\"\",'Bilgi-27'!S44:W44,0)","v":0},null,null,null,null,{"$f":"IF('Bilgi-27'!X44:AB44<>\"\",'Bilgi-27'!X44:AB44,0)","v":0},null,null,null,null,{"$f":"IF('Bilgi-27'!AC44:AG44<>\"\",'Bilgi-27'!AC44:AG44,0)","v":0},null,null,null,null,{"$f":"IF('Bilgi-27'!AH44:AL44<>\"\",'Bilgi-27'!AH44:AL44,0)","v":0},null,null,null,null,{"$f":"IF('Bilgi-27'!AM44:AQ44<>\"\",'Bilgi-27'!AM44:AQ44,0)","v":0},null,null,null,null,{"$f":"IF('Bilgi-27'!AR44:AV44<>\"\",'Bilgi-27'!AR44:AV44,0)","v":0},null,null,null,null,{"$f":"IF('Bilgi-27'!AW44:BA44<>\"\",'Bilgi-27'!AW44:BA44,0)","v":0},null,null,null,null,{"$f":"IF('Bilgi-27'!BB44:BF44<>\"\",'Bilgi-27'!BB44:BF44,0)","v":0},null,null,null,null,{"$f":"'Bilgi-27'!BG44","v":0},null,null,null,null,null,null,{"$f":"SUM(BM17:BN17)","v":0}]
[null,null,null,null,null,null,null,null,null,null,null,null,null,null,null,null,null,null,null,null,null,null,null,null,null,null,null,null,null,null,null,null,null,null,null,null,null,null,null,null,null,null,null,null,null,null,null,null,null,null,null,null,null,null,null,null,null,null,null,null,null,null,{"$f":"IF( U32=BM17,1,0)","v":1}]
[null,"Çizelge 2- Ders Yükleri",null,null,null,null,null,null,null,null,null,null,null,null,null,null,null,null,null,null,null,null,null,null,null,null,null,null,"Çizlge 3- Diğer Fakülte ve Yüksekokullarda",null,null,null,null,null,null,null,null,null,null,null,null,null,null,null,null,null,null,null,null,null,null,null,null,null,{"$f":"IF(BK19*BK20=0,\"Hatali Giriş\",\"\")","v":""},null,null,null,null,null,null,null,{"$f":"IF(W32=BN17,1,0)","v":1}]
[null,"Der.Kodu",null,null,null,"Dersin Adı",null,null,null,null,null,null,null,null,null,null,null,null,null,null,"Teo.",null,"Diğ.",null,null,null,null,null,"Der.Kodu",null,null,null,"Dersin Adı",null,null,null,null,null,null,null,null,null,null,null,null,null,null,null,"Teo.",null,"Diğ."]
[null,{"$f":"IF(F1form!T31=1,F1form!C31,\"\")","v":""},null,null,null,{"$f":"IF(F1form!T31=1,F1form!D31,\"\")","v":""},null,null,null,null,null,null,null,null,null,null,null,null,null,null,{"$f":"IF(F1form!T31=1,F1form!H31,\"\")","v":""},null,{"$f":"IF(F1form!T31=1,F1form!I31,\"\")","v":""},null,null,null,null,null,{"$f":"F1form!I60","v":0},null,null,null,{"$f":"F1form!I60","v":0},null,null,null,null,null,null,null,null,null,null,null,null,null,null,null,{"$f":"F1form!K60","v":0},null,{"$f":"F1form!L60","v":0}]
[null,{"$f":"IF(F1form!T32=1,F1form!C32,\"\")","v":""},null,null,null,{"$f":"IF(F1form!T32=1,F1form!D32,\"\")","v":""},null,null,null,null,null,null,null,null,null,null,null,null,null,null,{"$f":"IF(F1form!T32=1,F1form!H32,\"\")","v":""},null,{"$f":"IF(F1form!T32=1,F1form!I32,\"\")","v":""},null,null,null,null,null,{"$f":"F1form!I61","v":0},null,null,null,{"$f":"F1form!I61","v":0},null,null,null,null,null,null,null,null,null,null,null,null,null,null,null,{"$f":"F1form!K61","v":0},null,{"$f":"F1form!L61","v":0}]
[null,{"$f":"IF(F1form!T33=1,F1form!C33,\"\")","v":""},null,null,null,{"$f":"IF(F1form!T33=1,F1form!D33,\"\")","v":""},null,null,null,null,null,null,null,null,null,null,null,null,null,null,{"$f":"IF(F1form!T33=1,F1form!H33,\"\")","v":""},null,{"$f":"IF(F1form!T33=1,F1form!I33,\"\")","v":""},null,null,null,null,null,{"$f":"F1form!I62","v":0},null,null,null,{"$f":"F1form!I62","v":0},null,null,null,null,null,null,null,null,null,null,null,null,null,null,null,{"$f":"F1form!K62","v":0},null,{"$f":"F1form!L62","v":0}]
[null,{"$f":"IF(F1form!T34=1,F1form!C34,\"\")","v":""},null,null,null,{"$f":"IF(F1form!T34=1,F1form!D34,\"\")","v":""},null,null,null,null,null,null,null,null,null,null,null,null,null,null,{"$f":"IF(F1form!T34=1,F1form!H34,\"\")","v":""},null,{"$f":"IF(F1form!T34=1,F1form!I34,\"\")","v":""},null,null,null,null,null,{"$f":"F1form!I63","v":0},null,null,null,{"$f":"F1form!I63","v":0},null,null,null,null,null,null,null,null,null,null,null,null,null,null,null,{"$f":"F1form!K63","v":0},null,{"$f":"F1form!L63","v":0}]
[null,{"$f":"IF(F1form!T35=1,F1form!C35,\"\")","v":""},null,null,null,{"$f":"IF(F1form!T35=1,F1form!D35,\"\")","v":""},null,null,null,null,null,null,null,null,null,null,null,null,null,null,{"$f":"IF(F1form!T35=1,F1form!H35,\"\")","v":""},null,{"$f":"IF(F1form!T35=1,F1form!I35,\"\")","v":""},null,null,null,null,null,{"$f":"F1form!I64","v":0},null,null,null,{"$f":"F1form!I64","v":0},null,null,null,null,null,null,null,null,null,null,null,null,null,null,null,{"$f":"F1form!K64","v":0},null,{"$f":"F1form!L64","v":0}]
[null,{"$f":"IF(F1form!T36=1,F1form!C36,\"\")","v":""},null,null,null,{"$f":"IF(F1form!T36=1,F1form!D36,\"\")","v":""},null,null,null,null,null,null,null,null,null,null,null,null,null,null,{"$f":"IF(F1form!T36=1,F1form!H36,\"\")","v":""},null,{"$f":"IF(F1form!T36=1,F1form!I36,\"\")","v":""},null,null,null,null,null,{"$f":"F1form!I65","v":0},null,null,null,{"$f":"F1form!I65","v":0},null,null,null,null,null,null,null,null,null,null,null,null,null,null,null,{"$f":"F1form!K65","v":0},null,{"$f":"F1form!L65","v":0}]
[null,{"$f":"IF(F1form!T37=1,F1form!C37,\"\")","v":""},null,null,null,{"$f":"IF(F1form!T37=1,F1form!D37,\"\")","v":""},null,null,null,null,null,null,null,null,null,null,null,null,null,null,{"$f":"IF(F1form!T37=1,F1form!H37,\"\")","v":""},null,{"$f":"IF(F1form!T37=1,F1form!I37,\"\")","v":""},null,null,null,null,null,{"$f":"F1form!I66","v":0},null,null,null,{"$f":"F1form!I66","v":0},null,null,null,null,null,null,null,null,null,null,null,null,null,null,null,{"$f":"F1form!K66","v":0},null,{"$f":"F1form!L66","v":0}]
[null,{"$f":"IF(F1form!T38=1,F1form!C38,\"\")","v":""},null,null,null,{"$f":"IF(F1form!T38=1,F1form!D38,\"\")","v":""},null,null,null,null,null,null,null,null,null,null,null,null,null,null,{"$f":"IF(F1form!T38=1,F1form!H38,\"\")","v":""},null,{"$f":"IF(F1form!T38=1,F1form!I38,\"\")","v":""},null,null,null,null,null,{"$f":"F1form!I67","v":0},null,null,null,{"$f":"F1form!I67","v":0},null,null,null,null,null,null,null,null,null,null,null,null,null,null,null,{"$f":"F1form!K67","v":0},null,{"$f":"F1form!L67","v":0}]
[null,{"$f":"IF(F1form!T39=1,F1form!C39,\"\")","v":""},null,null,null,{"$f":"IF(F1form!T39=1,F1form!D39,\"\")","v":""},null,null,null,null,null,null,null,null,null,null,null,null,null,null,{"$f":"IF(F1form!T39=1,F1form!H39,\"\")","v":""},null,{"$f":"IF(F1form!T39=1,F1form!I39,\"\")","v":""},null,null,null,null,null,{"$f":"F1form!I68","v":0},null,null,null,{"$f":"F1form!I68","v":0},null,null,null,null,null,null,null,null,null,null,null,null,null,null,null,{"$f":"F1form!K68","v":0},null,{"$f":"F1form!L68","v":0}]
[null,{"$f":"IF(F1form!T40=1,F1form!C40,\"\")","v":""},null,null,null,{"$f":"IF(F1form!T40=1,F1form!D40,\"\")","v":""},null,null,null,null,null,null,null,null,null,null,null,null,null,null,{"$f":"IF(F1form!T40=1,F1form!H40,\"\")","v":""},null,{"$f":"IF(F1form!T40=1,F1form!I40,\"\")","v":""},null,null,null,null,null,{"$f":"F1form!I69","v":0},null,null,null,{"$f":"F1form!I69","v":0},null,null,null,null,null,null,null,null,null,null,null,null,null,null,null,{"$f":"F1form!K69","v":0},null,{"$f":"F1form!L69","v":0}]
[null,"TOPLAM",null,null,null,null,null,null,null,null,null,null,null,null,null,null,null,null,null,null,{"$f":"SUM(U22:V31)","v":0},null,{"$f":"SUM(W22:X31)","v":0},null,null,null,null,null,"TOPLAM",null,null,null,null,null,null,null,null,null,null,null,null,null,null,null,null,null,null,null,{"$f":"SUM(AW22:AX31)","v":0},null,{"$f":"SUM(AY22:AZ31)","v":0}]
[]
[null,"Çizelge 4- Yapılmayan Dersler",null,null,null,null,null,null,null,null,null,null,null,null,null,null,null,null,null,null,null,null,null,null,null,null,null,null,"Çizlge 5- Ara Sınavlar"]
[null,"Der.Kodu ve Adı",null,null,null,null,null,null,null,null,null,null,null,null,null,null,null,null,null,null,"Teo.",null,"Diğ.",null,"Y.Hafta",null,null,null,"Der.Kodu ve Adı",null,null,null,null,null,null,null,null,null,null,null,null,null,null,null,null,"Tarih",null,null,null,"Öğr.Say.",null,null,null,"A.Sın.Yük.",null,null,null,"Hafta"]
[null,null,null,null,null,null,null,null,null,null,null,null,null,null,null,null,null,null,null,null,null,null,null,null,null,null,null,null,{"$f":"IF(F1form!T31=1,F1form!C31,\"\")","v":""},null,null,null,{"$f":"IF(F1form!T31=1,F1form!D31,\"\")","v":""},null,null,null,null,null,null,null,null,null,null,null,null,"2012-11-23",null,null,null,{"$f":"IF(F1form!T31=1,F1form!F31,0)","v":0},null,null,null,{"$f":"IF(AX36>100,3,IF(AX36>50,2,IF(AX36>0,1,0)))","v":0}]
[null,null,null,null,null,null,null,null,null,null,null,null,null,null,null,null,null,null,null,null,null,null,null,null,null,null,null,null,{"$f":"IF(F1form!T32=1,F1form!C32,\"\")","v":""},null,null,null,{"$f":"IF(F1form!T32=1,F1form!D32,\"\")","v":""},null,null,null,null,null,null,null,null,null,null,null,null,"2012-11-23",null,null,null,{"$f":"IF(F1form!T32=1,F1form!F32,0)","v":0},null,null,null,{"$f":"IF(AX37>100,3,IF(AX37>50,2,IF(AX37>0,1,0)))","v":0}]
[null,null,null,null,null,null,null,null,null,null,null,null,null,null,null,null,null,null,null,null,null,null,null,null,null,null,null,null,{"$f":"IF(F1form!T33=1,F1form!C33,\"\")","v":""},null,null,null,{"$f":"IF(F1form!T33=1,F1form!D33,\"\")","v":""},null,null,null,null,null,null,null,null,null,null,null,null,"2012-11-23",null,null,null,{"$f":"IF(F1form!T33=1,F1form!F33,0)","v":0},null,null,null,{"$f":"IF(AX38>100,3,IF(AX38>50,2,IF(AX38>0,1,0)))","v":0}]
[null,null,null,null,null,null,null,null,null,null,null,null,null,null,null,null,null,null,null,null,null,null,null,null,null,null,null,null,{"$f":"IF(F1form!T34=1,F1form!C34,\"\")","v":""},null,null,null,{"$f":"IF(F1form!T34=1,F1form!D34,\"\")","v":""},null,null,null,null,null,null,null,null,null,null,null,null,null,null,null,null,{"$f":"IF(F1form!T34=1,F1form!F34,0)","v":0},null,null,null,{"$f":"IF(AX39>100,3,IF(AX39>50,2,IF(AX39>0,1,0)))","v":0}]
[null,null,null,null,null,null,null,null,null,null,null,null,null,null,null,null,null,null,null,null,null,null,null,null,null,null,null,null,{"$f":"IF(F1form!T35=1,F1form!C35,\"\")","v":""},null,null,null,{"$f":"IF(F1form!T35=1,F1form!D35,\"\")","v":""},null,null,null,null,null,null,null,null,null,null,null,null,null,null,null,null,{"$f":"IF(F1form!T35=1,F1form!F35,0)","v":0},null,null,null,0]
[null,null,null,null,null,null,null,null,null,null,null,null,null,null,null,null,null,null,null,null,null,null,null,null,null,null,null,null,{"$f":"IF(F1form!T36=1,F1form!C36,\"\")","v":""},null,null,null,{"$f":"IF(F1form!T36=1,F1form!D36,\"\")","v":""},null,null,null,null,null,null,null,null,null,null,null,null,null,null,null,null,{"$f":"IF(F1form!T36=1,F1form!F36,0)","v":0},null,null,null,0]
[null,null,null,null,null,null,null,null,null,null,null,null,null,null,null,null,null,null,null,null,null,null,null,null,null,null,null,null,{"$f":"IF(F1form!T37=1,F1form!C37,\"\")","v":""},null,null,null,{"$f":"IF(F1form!T37=1,F1form!D37,\"\")","v":""},null,null,null,null,null,null,null,null,null,null,null,null,null,null,null,null,{"$f":"IF(F1form!T37=1,F1form!F37,0)","v":0},null,null,null,0]
[null,null,null,null,null,null,null,null,null,null,null,null,null,null,null,null,null,null,null,null,null,null,null,null,null,null,null,null,{"$f":"IF(F1form!T38=1,F1form!C38,\"\")","v":""},null,null,null,{"$f":"IF(F1form!T38=1,F1form!D38,\"\")","v":""},null,null,null,null,null,null,null,null,null,null,null,null,null,null,null,null,{"$f":"IF(F1form!T38=1,F1form!F38,0)","v":0},null,null,null,0]
[null,null,null,null,null,null,null,null,null,null,null,null,null,null,null,null,null,null,null,null,null,null,null,null,null,null,null,null,{"$f":"IF(F1form!T39=1,F1form!C39,\"\")","v":""},null,null,null,{"$f":"IF(F1form!T39=1,F1form!D39,\"\")","v":""},null,null,null,null,null,null,null,null,null,null,null,null,null,null,null,null,{"$f":"IF(F1form!T39=1,F1form!F39,0)","v":0},null,null,null,0]
[null,null,null,null,null,null,null,null,null,null,null,null,null,null,null,null,null,null,null,null,null,null,null,null,null,null,null,null,{"$f":"IF(F1form!T40=1,F1form!C40,\"\")","v":""},null,null,null,{"$f":"IF(F1form!T40=1,F1form!D40,\"\")","v":""},null,null,null,null,null,null,null,null,null,null,null,null,null,null,null,null,{"$f":"IF(F1form!T40=1,F1form!F40,0)","v":0},null,null,null,0]
[null,"TOPLAM",null,null,null,null,null,null,null,null,null,null,null,null,null,null,null,null,null,null,{"$f":"SUM(U36:V45)","v":0},null,{"$f":"SUM(W36:X45)","v":0},null,null,null,null,null,"TOPLAM",null,null,null,null,null,null,null,null,null,null,null,null,null,null,null,null,null,null,null,null,null,null,null,null,{"$f":"SUM(BB36:BE45)","v":0}]
[]
[null,null,null,null,null,null,null,null,null,null,null,null,null,null,null,null,"yapilmayan",null,null,null,null,"1.h","t","u","2.h","t","u","3.h","t","u","4.h","t","u","5.h","t","u",null,"Sinav yükü",null,null,null,null,"1.h",null,"u","2.h",null,"u","3.h",null,"u","4.h",null,"u","5.h",null,"u"]
[null,null,null,null,null,null,null,null,null,null,null,null,null,null,null,null,null,null,null,null,null,"ders",null,null,null,null,null,null,null,null,null,null,null,null,null,null,null,null,null,null,null,null,"ders"]
[null,null,null,null,null,null,null,null,null,null,null,null,null,null,null,null,null,null,null,null,null,1,{"$f":"IF(Y36=1,U36,0)","v":0},{"$f":"IF(Y36=1,W36,0)","v":0},null,{"$f":"IF(Y36=2,U36,0)","v":0},{"$f":"IF(Y36=2,W36,0)","v":0},null,{"$f":"IF(Y36=3,U36,0)","v":0},{"$f":"IF(Y36=3,W36,0)","v":0},null,{"$f":"IF(Y36=4,U36,0)","v":0},{"$f":"IF(Y36=4,W36,0)","v":0},null,{"$f":"IF(Y36=5,U36,0)","v":0},{"$f":"IF(Y36=5,W36,0)","v":0},null,null,null,null,null,null,1,null,{"$f":"IF(BF36=1,BB36,0)","v":0},null,null,{"$f":"IF(BF36=2,BB36,0)","v":0},null,null,{"$f":"IF(BF36=3,BB36,0)","v":0},null,null,{"$f":"IF(BF36=4,BB36,0)","v":0},null,null,{"$f":"IF(BF36=5,BB36,0)","v":0}]
[null,null,null,null,null,null,null,null,null,null,null,null,null,null,null,null,null,null,null,null,null,2,{"$f":"IF(Y37=1,U37,0)","v":0},{"$f":"IF(Y37=1,W37,0)","v":0},null,{"$f":"IF(Y37=2,U37,0)","v":0},{"$f":"IF(Y37=2,W37,0)","v":0},null,{"$f":"IF(Y37=3,U37,0)","v":0},{"$f":"IF(Y37=3,W37,0)","v":0},null,{"$f":"IF(Y37=4,U37,0)","v":0},{"$f":"IF(Y37=4,W37,0)","v":0},null,{"$f":"IF(Y37=5,U37,0)","v":0},{"$f":"IF(Y37=5,W37,0)","v":0},null,null,null,null,null,null,2,null,{"$f":"IF(BF37=1,BB37,0)","v":0},null,null,{"$f":"IF(BF37=2,BB37,0)","v":0},null,null,{"$f":"IF(BF37=3,BB37,0)","v":0},null,null,{"$f":"IF(BF37=4,BB37,0)","v":0},null,null,{"$f":"IF(BF37=5,BB37,0)","v":0}]
[null,null,null,null,null,null,null,null,null,null,null,null,null,null,null,null,null,null,null,null,null,3,0,0,null,0,0,null,0,0,null,0,0,null,0,0,null,null,null,null,null,null,3,null,0,null,null,0,null,null,0,null,null,0,null,null,0]
[null,null,null,null,null,null,null,null,null,null,null,null,null,null,null,null,null,null,null,null,null,4,0,0,null,0,0,null,0,0,null,0,0,null,0,0,null,null,null,null,null,null,4,null,0,null,null,0,null,null,0,null,null,0,null,null,0]
[null,null,null,null,null,null,null,null,null,null,null,null,null,null,null,null,null,null,null,null,null,5,0,0,null,0,0,null,0,0,null,0,0,null,0,0,null,null,null,null,null,null,5,null,0,null,null,0,null,null,0,null,null,0,null,null,0]
[null,null,null,null,null,null,null,null,null,null,null,null,null,null,null,null,null,null,null,null,null,6,0,0,null,0,0,null,0,0,null,0,0,null,0,0,null,null,null,null,null,null,6,null,0,null,null,0,null,null,0,null,null,0,null,null,0]
[null,null,null,null,null,null,null,null,null,null,null,null,null,null,null,null,null,null,null,null,null,7,0,0,null,0,0,null,0,0,null,0,0,null,0,0,null,null,null,null,null,null,7,null,0,null,null,0,null,null,0,null,null,0,null,null,0]
[null,null,null,null,null,null,null,null,null,null,null,null,null,null,null,null,null,null,null,null,null,8,0,0,null,0,0,null,0,0,null,0,0,null,0,0,null,null,null,null,null,null,8,null,0,null,null,0,null,null,0,null,null,0,null,null,0]
[null,null,null,null,null,null,null,null,null,null,null,null,null,null,null,null,null,null,null,null,null,9,0,0,null,0,0,null,0,0,null,0,0,null,0,0,null,null,null,null,null,null,9,null,0,null,null,0,null,null,0,null,null,0,null,null,0]
[null,null,null,null,null,null,null,null,null,null,null,null,null,null,null,null,null,null,null,null,null,10,0,0,null,0,0,null,0,0,null,0,0,null,0,0,null,null,null,null,null,null,10,null,0,null,null,0,null,null,0,null,null,0,null,null,0]
[null,null,null,null,null,null,null,null,null,null,null,null,null,null,null,null,null,null,null,null,null,null,{"$f":"SUM(W50:W59)","v":0},{"$f":"SUM(X50:X59)","v":0},null,0,0,null,0,0,null,0,0,null,{"$f":"SUM(AI50:AI59)","v":0},{"$f":"SUM(AJ50:AJ59)","v":0},null,null,null,null,null,null,null,null,{"$f":"SUM(AS50:AS59)","v":0},null,null,{"$f":"SUM(AV50:AV59)","v":0},null,null,{"$f":"SUM(AY50:AY59)","v":0},null,null,{"$f":"SUM(BB50:BB59)","v":0},null,null,{"$f":"SUM(BE50:BE59)","v":0}]

{"sheet":"IOFORM","index":7,"n_rows":79,"n_cols":90,"rows_kept":79,"cut":false,"hidden":false,"merged":[[74,84,74,87],[5,0,5,62],[7,58,7,61],[8,58,8,61],[9,58,9,61],[9,34,9,39],[8,52,8,57],[9,40,9,45],[9,46,9,51],[8,40,8,45],[22,0,22,3],[10,58,10,61],[11,58,11,61],[12,58,12,61],[11,52,11,57],[11,34,11,39],[11,40,11,45],[11,46,11,51],[10,28,10,33],[10,52,10,57],[63,47,67,53],[68,33,68,40],[64,33,64,40],[64,41,64,43],[66,0,66,25],[66,26,66,30],[65,4,65,16],[65,17,65,21],[65,22,65,25],[67,44,67,46],[65,0,65,3],[65,41,65,43],[65,33,65,40],[65,26,65,30],[74,0,74,1],[75,0,75,1],[73,0,73,1],[22,48,22,49],[22,26,22,27],[22,28,22,29],[72,0,72,1],[72,3,72,7],[22,44,22,45],[59,22,59,25],[60,26,60,30],[60,33,60,40],[59,26,59,30],[59,33,59,40],[60,41,60,43],[22,36,22,37],[22,30,22,31],[65,44,65,46],[66,41,66,43],[66,44,66,46],[68,41,68,46],[68,47,68,53],[66,33,66,40],[67,33,67,40],[22,40,22,41],[22,42,22,43],[21,46,21,47],[77,19,77,31],[77,44,77,60],[71,39,71,60],[76,44,76,60],[71,33,71,37],[22,32,22,33],[22,34,22,35],[21,52,21,53],[21,54,21,61],[21,50,21,51],[22,52,22,53],[22,54,22,61],[21,36,21,37],[22,46,22,47],[21,48,21,49],[21,38,21,39],[22,38,22,39],[22,24,22,25],[21,24,21,25],[62,54,62,61],[22,50,22,51],[22,14,22,15],[22,16,22,17],[22,18,22,19],[22,20,22,21],[21,18,21,19],[21,20,21,21],[21,22,21,23],[22,4,22,5],[22,6,22,7],[22,8,22,9],[22,10,22,11],[22,12,22,13],[22,22,22,23],[21,16,21,17],[21,12,21,13],[21,14,21,15],[21,34,21,35],[21,40,21,41],[21,42,21,43],[21,44,21,45],[20,22,20,23],[21,28,21,29],[21,30,21,31],[21,32,21,33],[21,26,21,27],[20,42,20,43],[20,30,20,31],[20,32,20,33],[15,0,16,5],[19,0,19,3],[19,24,19,33],[20,18,20,19],[20,24,20,25],[20,10,20,11],[20,12,20,13],[20,8,20,9],[18,0,18,19],[20,26,20,27],[15,10,15,15],[15,16,15,21],[15,22,15,27],[16,6,16,9],[16,10,16,15],[16,16,16,21],[16,28,16,33],[16,22,16,27],[20,52,20,53],[20,44,20,45],[20,46,20,47],[20,34,20,35],[16,34,16,39],[18,29,18,35],[18,36,18,61],[20,48,20,49],[20,50,20,51],[20,28,20,29],[16,46,16,51],[16,58,16,61],[16,52,16,57],[19,54,20,61],[20,36,20,37],[20,38,20,39],[20,40,20,41],[14,16,14,21],[14,6,14,9],[14,10,14,15],[14,66,14,69],[12,22,12,27],[14,34,14,39],[14,52,14,57],[14,58,14,61],[13,66,13,69],[12,34,12,39],[12,40,12,45],[12,66,12,69],[12,46,12,51],[12,52,12,57],[13,58,13,61],[13,52,13,57],[14,40,14,45],[14,46,14,51],[15,66,15,69],[16,66,16,69],[15,52,15,57],[15,40,15,45],[15,46,15,51],[8,66,8,69],[11,66,11,69],[7,66,7,69],[6,34,6,39],[6,40,6,45],[6,46,6,51],[6,52,6,57],[6,66,6,69],[7,34,7,39],[7,40,7,45],[6,58,6,61],[9,66,9,69],[10,40,10,45],[10,46,10,51],[8,46,8,51],[10,66,10,69],[8,34,8,39],[15,58,15,61],[62,33,62,40],[62,41,62,46],[7,0,8,5],[7,6,7,9],[7,10,7,15],[7,22,7,27],[7,16,7,21],[63,0,63,3],[63,4,63,16],[63,17,63,21],[63,22,63,25],[63,26,63,30],[63,33,63,40],[60,22,60,25],[60,0,60,3],[60,4,60,16],[60,17,60,21],[58,26,58,30],[58,33,58,40],[57,26,57,30],[57,33,57,40],[10,6,10,9],[9,0,10,5],[9,10,9,15],[64,0,64,3],[64,4,64,16],[64,17,64,21],[64,22,64,25],[64,26,64,30],[61,22,61,25],[61,26,61,30],[62,0,62,3],[62,4,62,16],[62,17,62,21],[61,0,61,3],[61,4,61,16],[61,17,61,21],[62,22,62,25],[62,26,62,30],[61,33,61,40],[56,33,56,40],[56,41,56,46],[56,4,56,16],[59,0,59,3],[59,4,59,16],[58,0,58,3],[58,4,58,16],[58,17,58,21],[58,22,58,25],[59,17,59,21],[56,22,56,25],[56,26,56,30],[57,0,57,3],[57,4,57,16],[57,17,57,21],[57,22,57,25],[61,41,61,43],[61,44,61,46],[58,41,58,43],[58,44,58,46],[59,44,59,46],[60,44,60,46],[57,41,57,43],[51,0,51,18],[51,54,55,61],[55,33,55,40],[54,33,54,40],[55,41,55,43],[55,17,55,21],[55,0,55,16],[56,54,56,61],[56,47,56,53],[53,0,53,30],[53,33,53,40],[53,41,53,43],[53,44,53,46],[54,0,54,30],[55,44,55,46],[56,17,56,21],[56,0,56,3],[51,25,51,30],[51,33,51,40],[51,41,51,43],[51,47,55,53],[50,33,50,40],[51,19,51,21],[51,22,51,24],[48,22,48,24],[48,41,48,43],[48,44,48,46],[51,44,51,46],[50,19,50,21],[50,22,50,24],[50,25,50,30],[50,0,50,18],[43,0,43,4],[43,5,43,18],[44,0,44,4],[44,5,44,18],[46,0,46,4],[46,5,46,18],[46,19,46,21],[46,22,46,24],[48,0,48,4],[48,5,48,18],[47,0,47,4],[47,5,47,18],[47,19,47,21],[47,22,47,24],[49,0,49,4],[49,5,49,18],[49,19,49,21],[48,19,48,21],[45,0,45,4],[45,5,45,18],[45,19,45,21],[45,22,45,24],[43,44,43,46],[43,19,43,21],[44,19,44,21],[46,25,46,30],[46,33,46,40],[43,41,43,43],[43,25,43,30],[43,33,43,40],[44,54,44,61],[45,25,45,30],[45,33,45,40],[45,41,45,43],[45,44,45,46],[45,47,49,53],[49,41,49,43],[49,44,49,46],[48,25,48,30],[47,33,47,40],[47,25,47,30],[47,44,47,46],[42,0,42,4],[42,5,42,18],[39,0,39,18],[39,44,39,46],[39,19,39,21],[41,44,41,46],[41,25,41,30],[42,25,42,30],[42,44,42,46],[40,25,40,30],[40,33,40,40],[41,0,41,4],[41,5,41,18],[41,19,41,21],[41,22,41,24],[39,22,39,24],[39,25,39,30],[40,41,40,43],[40,44,40,46],[42,19,42,21],[42,22,42,24],[36,0,36,23],[36,24,36,26],[36,27,36,29],[36,31,36,54],[35,0,35,4],[35,5,35,23],[35,36,35,54],[35,24,35,26],[40,0,40,4],[40,5,40,18],[40,19,40,21],[40,22,40,24],[31,0,31,4],[31,5,31,23],[31,24,31,26],[31,27,31,29],[33,36,33,54],[24,30,36,30],[28,0,28,4],[35,27,35,29],[35,31,35,35],[34,0,34,4],[34,5,34,23],[34,24,34,26],[34,27,34,29],[34,31,34,35],[32,31,32,35],[32,36,32,54],[30,36,30,54],[27,27,27,29],[26,0,26,4],[25,0,25,4],[28,5,28,23],[28,24,28,26],[28,27,28,29],[27,0,27,4],[33,0,33,4],[33,5,33,23],[33,24,33,26],[33,27,33,29],[33,31,33,35],[32,0,32,4],[32,5,32,23],[32,24,32,26],[32,27,32,29],[30,0,30,4],[30,5,30,23],[30,24,30,26],[30,27,30,29],[30,31,30,35],[28,55,28,57],[28,58,28,61],[27,31,27,35],[27,36,27,54],[29,58,29,61],[27,5,27,23],[27,24,27,26],[29,0,29,4],[29,5,29,23],[29,24,29,26],[29,27,29,29],[6,28,6,33],[7,52,7,57],[19,34,19,43],[19,44,19,53],[16,40,16,45],[7,46,7,51],[13,28,13,33],[7,28,7,33],[9,52,9,57],[8,28,8,33],[11,28,11,33],[12,28,12,33],[13,34,13,39],[15,34,15,39],[15,28,15,33],[6,0,6,9],[6,10,6,15],[6,16,6,21],[6,22,6,27],[8,6,8,9],[8,10,8,15],[8,16,8,21],[10,10,10,15],[8,22,8,27],[9,16,9,21],[10,16,10,21],[3,34,3,44],[27,58,27,61],[9,6,9,9],[26,5,26,23],[26,24,26,26],[26,27,26,29],[14,22,14,27],[14,28,14,33],[18,20,18,27],[10,34,10,39],[25,27,25,29],[25,5,25,23],[24,0,24,29],[9,22,9,27],[9,28,9,33],[11,22,11,27],[3,8,3,27],[3,28,3,33],[12,16,12,21],[13,46,13,51],[11,10,11,15],[11,16,11,21],[13,40,13,45],[10,22,10,27],[21,0,21,3],[21,4,21,5],[21,6,21,7],[21,8,21,9],[21,10,21,11],[12,10,12,15],[13,0,14,5],[13,6,13,9],[15,6,15,9],[12,6,12,9],[19,4,19,13],[19,14,19,23],[11,0,12,5],[11,6,11,9],[13,22,13,27],[13,10,13,15],[13,16,13,21],[20,14,20,15],[20,16,20,17],[20,0,20,3],[20,4,20,5],[20,6,20,7],[20,20,20,21],[17,0,17,61],[78,1,78,14],[78,19,78,35],[78,44,78,60],[3,45,3,48],[3,49,3,54],[3,56,3,61],[23,0,23,61],[3,0,3,7],[73,3,73,7],[25,24,25,26],[35,58,35,61],[36,55,36,57],[36,58,36,61],[35,55,35,57],[39,33,39,40],[39,41,39,43],[37,0,37,61],[38,0,38,30],[38,31,69,32],[38,33,38,61],[31,58,31,61],[32,58,32,61],[33,55,33,57],[33,58,33,61],[0,0,0,29],[0,30,0,61],[1,0,1,61],[2,0,2,7],[2,8,2,27],[2,28,2,33],[2,34,2,44],[2,45,2,51],[2,52,2,53],[2,54,2,59],[2,60,2,61],[34,55,34,57],[34,58,34,61],[31,55,31,57],[24,31,24,61],[25,55,25,57],[25,58,25,61],[26,55,26,57],[26,58,26,61],[29,31,29,35],[25,36,25,54],[29,36,29,54],[28,31,28,35],[28,36,28,54],[27,55,27,57],[29,55,29,57],[26,31,26,35],[26,36,26,54],[25,31,25,35],[30,55,30,57],[30,58,30,61],[32,55,32,57],[31,31,31,35],[31,36,31,54],[34,36,34,54],[73,84,73,87],[72,84,72,87],[42,33,42,40],[41,33,41,40],[41,41,41,43],[49,22,49,24],[49,25,49,30],[49,33,49,40],[42,41,42,43],[44,22,44,24],[44,25,44,30],[44,33,44,40],[44,41,44,46],[45,54,49,61],[39,47,43,53],[39,54,43,61],[43,22,43,24],[52,33,52,40],[52,41,52,43],[55,26,55,30],[55,22,55,25],[44,47,44,53],[48,33,48,40],[46,41,46,43],[50,47,50,53],[54,41,54,43],[54,44,54,46],[52,44,52,46],[71,84,71,87],[46,44,46,46],[50,54,50,61],[62,47,62,53],[57,47,61,53],[63,41,63,43],[64,44,64,46],[63,44,63,46],[63,54,67,61],[68,54,68,61],[67,41,67,43],[57,54,61,61],[57,44,57,46],[59,41,59,43],[47,41,47,43],[50,41,50,46],[69,17,69,19],[69,20,69,22],[71,14,71,16],[71,18,71,19],[70,0,70,61],[69,33,69,53],[69,54,69,61],[71,2,71,13],[71,0,71,1],[71,30,71,31],[71,23,71,29],[71,20,71,22]]}
["AYLIK DERS YÜKLERİ BİLDİRİM FORMU",null,null,null,null,null,null,null,null,null,null,null,null,null,null,null,null,null,null,null,null,null,null,null,null,null,null,null,null,null,"İKİNCİ ÖĞRETİM"]
["Çizelge 1- Genel Bilgiler"]
["Ünv.Adı Soyadı",null,null,null,null,null,null,null,{"$f":"IOGIRIS!I5","v":"Öğr.Gör. Celalettin AYDIN"},null,null,null,null,null,null,null,null,null,null,null,null,null,null,null,null,null,null,null,"Bölümü",null,null,null,null,null,{"$f":"IOGIRIS!AK4","v":"Bilgisayar Bölümü"},null,null,null,null,null,null,null,null,null,null,"Zor.Der.Yükü",null,null,null,null,null,null,{"$f":"IOGIRIS!AN3","v":0},null,"Hafta Sayısı",null,null,null,null,null,{"$f":"IOGIRIS!I4","v":1}]
["Fakülte -Yük.Ok.",null,null,null,null,null,null,null,{"$f":"IOGIRIS!I2","v":"Ç.Ü. CEyhan Meslek Yüksekokulu"},null,null,null,null,null,null,null,null,null,null,null,null,null,null,null,null,null,null,null,"İdari Görevi",null,null,null,null,null,{"$f":"IOGIRIS!AN2","v":0},null,null,null,null,null,null,null,null,null,null,"Dönem ",null,null,null,{"$f":"IOGIRIS!I3","v":"2025-09-27"},null,null,null,null,null,"-",{"$f":"IOGIRIS!O3","v":"2025-10-01"}]
[]
["Çizelge 2- Haftalık Ders Programı"]
["Günler",null,null,null,null,null,null,null,null,null,{"$f":"IOGIRIS!I8","v":"13:00-13:45"},null,null,null,null,null,{"$f":"IOGIRIS!N8","v":"14:00-14:45"},null,null,null,null,null,{"$f":"IOGIRIS!S8","v":"15:00-14:45"},null,null,null,null,null,{"$f":"IOGIRIS!X8","v":"16:00-16:45"},null,null,null,null,null,{"$f":"IOGIRIS!AC8","v":"17:00-17:45"},null,null,null,null,null,{"$f":"IOGIRIS!AH8","v":"18:00-1845"},null,null,null,null,null,{"$f":"IOGIRIS!AM8","v":"19:00-19:45"},null,null,null,null,null,{"$f":"IOGIRIS!AR8","v":"20:00-20:45"},null,null,null,null,null,{"$f":"IOGIRIS!AW8","v":"21:00-21:45"},null,null,null,{"$f":"IOGIRIS!BB8","v":"22:00-22:45"},null,null,null,"Toplam",null,null,null,null,null,1,2,3,4,5,6,7,8,9,10]
["Pazartesi",null,null,null,null,null,"Teorik",null,null,null,{"$f":"IOGIRIS!I9","v":0},null,null,null,null,null,{"$f":"IOGIRIS!N9","v":0},null,null,null,null,null,{"$f":"IOGIRIS!S9","v":0},null,null,null,null,null,{"$f":"IOGIRIS!X9","v":0},null,null,null,null,null,{"$f":"IOGIRIS!AC9","v":0},null,null,null,null,null,{"$f":"IOGIRIS!AH9","v":0},null,null,null,null,null,{"$f":"IOGIRIS!AM9","v":0},null,null,null,null,null,{"$f":"IOGIRIS!AR9","v":0},null,null,null,null,null,{"$f":"IOGIRIS!AW9","v":0},null,null,null,{"$f":"IOGIRIS!BB9","v":0},null,null,null,{"$f":"CE8","v":0},null,null,null,null,null,{"$f":"IF(K8<>0,1,0)","v":0},{"$f":"IF(Q8<>0,1,0)","v":0},{"$f":"IF(W8<>0,1,0)","v":0},{"$f":"IF(AC8<>0,1,0)","v":0},{"$f":"IF(AI8<>0,1,0)","v":0},{"$f":"IF(AO8<>0,1,0)","v":0},{"$f":"IF(AU8<>0,1,0)","v":0},{"$f":"IF(BA8<>0,1,0)","v":0},{"$f":"IF(BG8<>0,1,0)","v":0},{"$f":"IF(BK8<>0,1,0)","v":0},{"$f":"SUM(BU8:CD8)","v":0}]
[null,null,null,null,null,null,"Diğer f.",null,null,null,{"$f":"IOGIRIS!I10","v":0},null,null,null,null,null,{"$f":"IOGIRIS!N10","v":0},null,null,null,null,null,{"$f":"IOGIRIS!S10","v":0},null,null,null,null,null,{"$f":"IOGIRIS!X10","v":0},null,null,null,null,null,{"$f":"IOGIRIS!AC10","v":0},null,null,null,null,null,{"$f":"IOGIRIS!AH10","v":0},null,null,null,null,null,{"$f":"IOGIRIS!AM10","v":0},null,null,null,null,null,{"$f":"IOGIRIS!AR10","v":0},null,null,null,null,null,{"$f":"IOGIRIS!AW10","v":0},null,null,null,{"$f":"IOGIRIS!BB10","v":0},null,null,null,{"$f":"CE9","v":0},null,null,null,null,null,{"$f":"IF(K9<>0,1,0)","v":0},{"$f":"IF(Q9<>0,1,0)","v":0},{"$f":"IF(W9<>0,1,0)","v":0},{"$f":"IF(AC9<>0,1,0)","v":0},{"$f":"IF(AI9<>0,1,0)","v":0},{"$f":"IF(AO9<>0,1,0)","v":0},{"$f":"IF(AU9<>0,1,0)","v":0},{"$f":"IF(BA9<>0,1,0)","v":0},{"$f":"IF(BG9<>0,1,0)","v":0},{"$f":"IF(BK9<>0,1,0)","v":0},0]
["Salı",null,null,null,null,null,"Teorik",null,null,null,{"$f":"IOGIRIS!I11","v":0},null,null,null,null,null,{"$f":"IOGIRIS!N11","v":0},null,null,null,null,null,{"$f":"IOGIRIS!S11","v":0},null,null,null,null,null,{"$f":"IOGIRIS!X11","v":0},null,null,null,null,null,{"$f":"IOGIRIS!AC11","v":0},null,null,null,null,null,{"$f":"IOGIRIS!AH11","v":0},null,null,null,null,null,{"$f":"IOGIRIS!AM11","v":0},null,null,null,null,null,{"$f":"IOGIRIS!AR11","v":0},null,null,null,null,null,{"$f":"IOGIRIS!AW11","v":0},null,null,null,{"$f":"IOGIRIS!BB11","v":0},null,null,null,{"$f":"CE10","v":0},null,null,null,null,null,{"$f":"IF(K10<>0,1,0)","v":0},{"$f":"IF(Q10<>0,1,0)","v":0},{"$f":"IF(W10<>0,1,0)","v":0},{"$f":"IF(AC10<>0,1,0)","v":0},{"$f":"IF(AI10<>0,1,0)","v":0},{"$f":"IF(AO10<>0,1,0)","v":0},{"$f":"IF(AU10<>0,1,0)","v":0},{"$f":"IF(BA10<>0,1,0)","v":0},0,0,0]
[null,null,null,null,null,null,"Diğer f.",null,null,null,{"$f":"IOGIRIS!I12","v":0},null,null,null,null,null,{"$f":"IOGIRIS!N12","v":0},null,null,null,null,null,{"$f":"IOGIRIS!S12","v":0},null,null,null,null,null,{"$f":"IOGIRIS!X12","v":0},null,null,null,null,null,{"$f":"IOGIRIS!AC12","v":0},null,null,null,null,null,{"$f":"IOGIRIS!AH12","v":0},null,null,null,null,null,{"$f":"IOGIRIS!AM12","v":0},null,null,null,null,null,{"$f":"IOGIRIS!AR12","v":0},null,null,null,null,null,{"$f":"IOGIRIS!AW12","v":0},null,null,null,{"$f":"IOGIRIS!BB12","v":0},null,null,null,0,null,null,null,null,null,0,0,0,0,0,0,0,0,0,0,0]
["Çarşamba",null,null,null,null,null,"Teorik",null,null,null,{"$f":"IOGIRIS!I13","v":0},null,null,null,null,null,{"$f":"IOGIRIS!N13","v":0},null,null,null,null,null,{"$f":"IOGIRIS!S13","v":0},null,null,null,null,null,{"$f":"IOGIRIS!X13","v":0},null,null,null,null,null,{"$f":"IOGIRIS!AC13","v":0},null,null,null,null,null,{"$f":"IOGIRIS!AH13","v":0},null,null,null,null,null,{"$f":"IOGIRIS!AM13","v":0},null,null,null,null,null,{"$f":"IOGIRIS!AR13","v":0},null,null,null,null,null,{"$f":"IOGIRIS!AW13","v":0},null,null,null,{"$f":"IOGIRIS!BB13","v":0},null,null,null,0,null,null,null,null,null,0,0,0,0,0,0,0,0,0,0,0]
[null,null,null,null,null,null,"Diğer f.",null,null,null,{"$f":"IOGIRIS!I14","v":0},null,null,null,null,null,{"$f":"IOGIRIS!N14","v":0},null,null,null,null,null,{"$f":"IOGIRIS!S14","v":0},null,null,null,null,null,{"$f":"IOGIRIS!X14","v":0},null,null,null,null,null,{"$f":"IOGIRIS!AC14","v":0},null,null,null,null,null,{"$f":"IOGIRIS!AH14","v":0},null,null,null,null,null,{"$f":"IOGIRIS!AM14","v":0},null,null,null,null,null,{"$f":"IOGIRIS!AR14","v":0},null,null,null,null,null,{"$f":"IOGIRIS!AW14","v":0},null,null,null,{"$f":"IOGIRIS!BB14","v":0},null,null,null,0,null,null,null,null,null,0,0,0,0,0,0,0,0,0,0,0]
["Perşembe",null,null,null,null,null,"Teorik",null,null,null,{"$f":"IOGIRIS!I15","v":0},null,null,null,null,null,{"$f":"IOGIRIS!N15","v":0},null,null,null,null,null,{"$f":"IOGIRIS!S15","v":0},null,null,null,null,null,{"$f":"IOGIRIS!X15","v":0},null,null,null,null,null,{"$f":"IOGIRIS!AC15","v":0},null,null,null,null,null,{"$f":"IOGIRIS!AH15","v":0},null,null,null,null,null,{"$f":"IOGIRIS!AM15","v":0},null,null,null,null,null,{"$f":"IOGIRIS!AR15","v":0},null,null,null,null,null,{"$f":"IOGIRIS!AW15","v":0},null,null,null,{"$f":"IOGIRIS!BB15","v":0},null,null,null,0,null,null,null,null,null,0,0,0,0,0,0,0,0,0,0,0]
[null,null,null,null,null,null,"Diğer f.",null,null,null,{"$f":"IOGIRIS!I16","v":0},null,null,null,null,null,{"$f":"IOGIRIS!N16","v":0},null,null,null,null,null,{"$f":"IOGIRIS!S16","v":0},null,null,null,null,null,{"$f":"IOGIRIS!X16","v":0},null,null,null,null,null,{"$f":"IOGIRIS!AC16","v":0},null,null,null,null,null,{"$f":"IOGIRIS!AH16","v":0},null,null,null,null,null,{"$f":"IOGIRIS!AM16","v":0},null,null,null,null,null,{"$f":"IOGIRIS!AR16","v":0},null,null,null,null,null,{"$f":"IOGIRIS!AW16","v":0},null,null,null,{"$f":"IOGIRIS!BB16","v":0},null,null,null,0,null,null,null,null,null,0,0,0,0,0,0,0,0,0,0,0]
["Cuma",null,null,null,null,null,"Teorik",null,null,null,{"$f":"IOGIRIS!I17","v":0},null,null,null,null,null,{"$f":"IOGIRIS!N17","v":0},null,null,null,null,null,{"$f":"IOGIRIS!S17","v":0},null,null,null,null,null,{"$f":"IOGIRIS!X17","v":0},null,null,null,null,null,{"$f":"IOGIRIS!AC17","v":0},null,null,null,null,null,{"$f":"IOGIRIS!AH17","v":0},null,null,null,null,null,{"$f":"IOGIRIS!AM17","v":0},null,null,null,null,null,{"$f":"IOGIRIS!AR17","v":0},null,null,null,null,null,{"$f":"IOGIRIS!AW17","v":0},null,null,null,{"$f":"IOGIRIS!BB17","v":0},null,null,null,0,null,null,null,null,null,0,0,0,0,0,0,0,0,0,0,0]
[null,null,null,null,null,null,"Diğer f.",null,null,null,{"$f":"IOGIRIS!I18","v":0},null,null,null,null,null,{"$f":"IOGIRIS!N18","v":0},null,null,null,null,null,{"$f":"IOGIRIS!S18","v":0},null,null,null,null,null,{"$f":"IOGIRIS!X18","v":0},null,null,null,null,null,{"$f":"IOGIRIS!AC18","v":0},null,null,null,null,null,{"$f":"IOGIRIS!AH18","v":0},null,null,null,null,null,{"$f":"IOGIRIS!AM18","v":0},null,null,null,null,null,{"$f":"IOGIRIS!AR18","v":0},null,null,null,null,null,{"$f":"IOGIRIS!AW18","v":0},null,null,null,{"$f":"IOGIRIS!BB18","v":0},null,null,null,0,null,null,null,null,null,0,0,0,0,0,0,0,0,0,0,0]
[]
["Çizelge 3- Aylık Ders Saati Dağılımı",null,null,null,null,null,null,null,null,null,null,null,null,null,null,null,null,null,null,null,{"$f":"AX4","v":"2025-09-27"},null,null,null,null,null,null,null,"-",{"$f":"BE4","v":"2025-10-01"},null,null,null,null,null,null,null,null,null,null,null,null,null,null,null,null,null,null,null,null,null,null,null,null,null,null,null,null,null,null,null,null,null,null,"ikili",{"$f":"SUM(BU8:BX17)","v":0},{"$f":"SUM(BU8:BX17)","v":0},null,"aksam",null,null,{"$f":"SUM(BY8:CD17)","v":0}]
[null,null,null,null,"1. HAFTA",null,null,null,null,null,null,null,null,null,"2. HAFTA",null,null,null,null,null,null,null,null,null,"3. HAFTA",null,null,null,null,null,null,null,null,null,"4. HAFTA",null,null,null,null,null,null,null,null,null,"5. HAFTA",null,null,null,null,null,null,null,null,null,"TOPLAM",null,null,null,null,null,null,null,null,null,"teo",{"$f":"SUM(BU8:BX8,BU10:BX10,BU12:BX12,BU14:BX14,BU16:BX16)","v":0},{"$f":"SUM(BU8:BX8,BU10:BX10,BU12:BX12,BU14:BX14,BU16:BX16)","v":0},null,"teo",null,null,{"$f":"SUM(BY8:CD8,BY10:CD10,BY12:CD12,BY14:CD14,BY16:CD16)","v":0}]
["Günler",null,null,null,{"$f":"AX4","v":"2025-09-27"},null,{"$f":"E21+1","v":"2025-09-28"},null,{"$f":"G21+1","v":"2025-09-29"},null,{"$f":"I21+1","v":"2025-09-30"},null,{"$f":"K21+1","v":"2025-10-01"},null,{"$f":"M21+3","v":"2025-10-04"},null,{"$f":"O21+1","v":"2025-10-05"},null,{"$f":"Q21+1","v":"2025-10-06"},null,{"$f":"S21+1","v":"2025-10-07"},null,{"$f":"U21+1","v":"2025-10-08"},null,{"$f":"W21+3","v":"2025-10-11"},null,{"$f":"Y21+1","v":"2025-10-12"},null,{"$f":"AA21+1","v":"2025-10-13"},null,{"$f":"AC21+1","v":"2025-10-14"},null,{"$f":"AE21+1","v":"2025-10-15"},null,{"$f":"AG21+3","v":"2025-10-18"},null,{"$f":"AI21+1","v":"2025-10-19"},null,{"$f":"AK21+1","v":"2025-10-20"},null,{"$f":"AM21+1","v":"2025-10-21"},null,{"$f":"AO21+1","v":"2025-10-22"},null,{"$f":"AQ21+3","v":"2025-10-25"},null,{"$f":"AS21+1","v":"2025-10-26"},null,{"$f":"AU21+1","v":"2025-10-27"},null,{"$f":"AW21+1","v":"2025-10-28"},null,{"$f":"AY21+1","v":"2025-10-29"},null,null,null,null,null,null,null,null,null,null,null,"uyg",{"$f":"SUM(BU9:BX9,BU11:BX11,BU13:BX13,BU15:BX15,BU17:BX17)","v":0},{"$f":"SUM(BU9:BY9,BU11:BY11,BU13:BY13,BU15:BY15,BU17:BY17)","v":0},null,"uy",null,null,{"$f":"SUM(BY9:CD9,BY11:CD11,BY13:CD13,BY15:CD15,BY17:CD17)","v":0}]
["Teorik",null,null,null,{"$f":"BO8","v":0},null,{"$f":"BO10","v":0},null,{"$f":"BO12","v":0},null,{"$f":"BO14","v":0},null,{"$f":"BO16","v":0},null,{"$f":"IF($BI$3>=2,E22,0)","v":0},null,{"$f":"IF($BI$3>=2,G22,0)","v":0},null,{"$f":"IF($BI$3>=2,I22,0)","v":0},null,{"$f":"IF($BI$3>=2,K22,0)","v":0},null,{"$f":"IF($BI$3>=2,M22,0)","v":0},null,{"$f":"IF($BI$3>=3,O22,0)","v":0},null,{"$f":"IF($BI$3>=3,Q22,0)","v":0},null,{"$f":"IF($BI$3>=3,S22,0)","v":0},null,{"$f":"IF($BI$3>=3,U22,0)","v":0},null,{"$f":"IF($BI$3>=3,W22,0)","v":0},null,{"$f":"IF($BI$3>=4,Y22,0)","v":0},null,{"$f":"IF($BI$3>=4,AA22,0)","v":0},null,{"$f":"IF($BI$3>=4,AC22,0)","v":0},null,{"$f":"IF($BI$3>=4,AE22,0)","v":0},null,{"$f":"IF($BI$3>=4,AG22,0)","v":0},null,{"$f":"IF($BI$3>=5,AI22,0)","v":0},null,{"$f":"IF($BI$3>=5,AK22,0)","v":0},null,{"$f":"IF($BI$3>=5,AM22,0)","v":0},null,{"$f":"IF($BI$3>=5,AO22,0)","v":0},null,{"$f":"IF($BI$3>=5,AQ22,0)","v":0},null,{"$f":"SUM(E22:BB22)","v":0},null,null,null,null,null,null,null,null,null,"sinav",{"$f":"SUM(BN20:BN21)","v":0},null,null,null,null,null,{"$f":"SUM(BT20:BT21)","v":0}]
["Diğer",null,null,null,{"$f":"BO9","v":0},null,{"$f":"BO11","v":0},null,{"$f":"BO13","v":0},null,{"$f":"BO15","v":0},null,{"$f":"BO17","v":0},null,{"$f":"IF($BI$3>=2,E23,0)","v":0},null,{"$f":"IF($BI$3>=2,G23,0)","v":0},null,{"$f":"IF($BI$3>=2,I23,0)","v":0},null,{"$f":"IF($BI$3>=2,K23,0)","v":0},null,{"$f":"IF($BI$3>=2,M23,0)","v":0},null,{"$f":"IF($BI$3>=3,O23,0)","v":0},null,{"$f":"IF($BI$3>=3,Q23,0)","v":0},null,{"$f":"IF($BI$3>=3,S23,0)","v":0},null,{"$f":"IF($BI$3>=3,U23,0)","v":0},null,{"$f":"IF($BI$3>=3,W23,0)","v":0},null,{"$f":"IF($BI$3>=4,Y23,0)","v":0},null,{"$f":"IF($BI$3>=4,AA23,0)","v":0},null,{"$f":"IF($BI$3>=4,AC23,0)","v":0},null,{"$f":"IF($BI$3>=4,AE23,0)","v":0},null,{"$f":"IF($BI$3>=4,AG23,0)","v":0},null,{"$f":"IF($BI$3>=5,AI23,0)","v":0},null,{"$f":"IF($BI$3>=5,AK23,0)","v":0},null,{"$f":"IF($BI$3>=5,AM23,0)","v":0},null,{"$f":"IF($BI$3>=5,AO23,0)","v":0},null,{"$f":"IF($BI$3>=5,AQ23,0)","v":0},null,{"$f":"SUM(E23:BB23)","v":0},null,null,null,null,null,null,null,null,null,null,null,{"$f":"SUM(BO20:BO22)","v":0}]
[]
["Çizelge 4- Ders Yükleri",null,null,null,null,null,null,null,null,null,null,null,null,null,null,null,null,null,null,null,null,null,null,null,null,null,null,null,null,null,null,"Çizlge 5- Diğer Fakülte ve Yüksekokullarda"]
["Der.Kodu",null,null,null,null,"Dersin Adı",null,null,null,null,null,null,null,null,null,null,null,null,null,null,null,null,null,null,"Teo.",null,null,"Diğ.",null,null,null,"Der.Kodu",null,null,null,null,"Dersin Adı",null,null,null,null,null,null,null,null,null,null,null,null,null,null,null,null,null,null,"Teo.",null,null,"Diğ."]
[{"$f":"IOGIRIS!B22","v":""},null,null,null,null,{"$f":"IOGIRIS!F22","v":""},null,null,null,null,null,null,null,null,null,null,null,null,null,null,null,null,null,null,{"$f":"IOGIRIS!U22","v":""},null,null,{"$f":"IOGIRIS!W22","v":""},null,null,null,{"$f":"F1form!I60","v":0},null,null,null,null,{"$f":"F1form!J60","v":0},null,null,null,null,null,null,null,null,null,null,null,null,null,null,null,null,null,null,{"$f":"F1form!K60","v":0},null,null,{"$f":"F1form!L60","v":0}]
[{"$f":"IOGIRIS!B23","v":""},null,null,null,null,{"$f":"IOGIRIS!F23","v":""},null,null,null,null,null,null,null,null,null,null,null,null,null,null,null,null,null,null,{"$f":"IOGIRIS!U23","v":""},null,null,{"$f":"IOGIRIS!W23","v":""},null,null,null,{"$f":"F1form!I61","v":0},null,null,null,null,{"$f":"F1form!J61","v":0},null,null,null,null,null,null,null,null,null,null,null,null,null,null,null,null,null,null,{"$f":"F1form!K61","v":0},null,null,{"$f":"F1form!L61","v":0}]
[{"$f":"IOGIRIS!B24","v":""},null,null,null,null,{"$f":"IOGIRIS!F24","v":""},null,null,null,null,null,null,null,null,null,null,null,null,null,null,null,null,null,null,{"$f":"IOGIRIS!U24","v":""},null,null,{"$f":"IOGIRIS!W24","v":""},null,null,null,{"$f":"F1form!I62","v":0},null,null,null,null,{"$f":"F1form!J62","v":0},null,null,null,null,null,null,null,null,null,null,null,null,null,null,null,null,null,null,{"$f":"F1form!K62","v":0},null,null,{"$f":"F1form!L62","v":0}]
[{"$f":"IOGIRIS!B25","v":""},null,null,null,null,{"$f":"IOGIRIS!F25","v":""},null,null,null,null,null,null,null,null,null,null,null,null,null,null,null,null,null,null,{"$f":"IOGIRIS!U25","v":""},null,null,{"$f":"IOGIRIS!W25","v":""},null,null,null,{"$f":"F1form!I63","v":0},null,null,null,null,{"$f":"F1form!J63","v":0},null,null,null,null,null,null,null,null,null,null,null,null,null,null,null,null,null,null,{"$f":"F1form!K63","v":0},null,null,{"$f":"F1form!L63","v":0}]
[{"$f":"IOGIRIS!B26","v":""},null,null,null,null,{"$f":"IOGIRIS!F26","v":""},null,null,null,null,null,null,null,null,null,null,null,null,null,null,null,null,null,null,{"$f":"IOGIRIS!U26","v":""},null,null,{"$f":"IOGIRIS!W26","v":""},null,null,null,{"$f":"F1form!I64","v":0},null,null,null,null,{"$f":"F1form!J64","v":0},null,null,null,null,null,null,null,null,null,null,null,null,null,null,null,null,null,null,{"$f":"F1form!K64","v":0},null,null,{"$f":"F1form!L64","v":0}]
[{"$f":"IOGIRIS!B27","v":""},null,null,null,null,{"$f":"IOGIRIS!F27","v":""},null,null,null,null,null,null,null,null,null,null,null,null,null,null,null,null,null,null,{"$f":"IOGIRIS!U27","v":""},null,null,{"$f":"IOGIRIS!W27","v":""},null,null,null,{"$f":"F1form!I65","v":0},null,null,null,null,{"$f":"F1form!J65","v":0},null,null,null,null,null,null,null,null,null,null,null,null,null,null,null,null,null,null,{"$f":"F1form!K65","v":0},null,null,{"$f":"F1form!L65","v":0}]
[{"$f":"IOGIRIS!B28","v":""},null,null,null,null,{"$f":"IOGIRIS!F28","v":""},null,null,null,null,null,null,null,null,null,null,null,null,null,null,null,null,null,null,{"$f":"IOGIRIS!U28","v":""},null,null,{"$f":"IOGIRIS!W28","v":""},null,null,null,{"$f":"F1form!I66","v":0},null,null,null,null,{"$f":"F1form!J66","v":0},null,null,null,null,null,null,null,null,null,null,null,null,null,null,null,null,null,null,{"$f":"F1form!K66","v":0},null,null,{"$f":"F1form!L66","v":0}]
[{"$f":"IOGIRIS!B29","v":""},null,null,null,null,{"$f":"IOGIRIS!F29","v":""},null,null,null,null,null,null,null,null,null,null,null,null,null,null,null,null,null,null,{"$f":"IOGIRIS!U29","v":""},null,null,{"$f":"IOGIRIS!W29","v":""},null,null,null,{"$f":"F1form!I67","v":0},null,null,null,null,{"$f":"F1form!J67","v":0},null,null,null,null,null,null,null,null,null,null,null,null,null,null,null,null,null,null,{"$f":"F1form!K67","v":0},null,null,{"$f":"F1form!L67","v":0}]
[{"$f":"IOGIRIS!B30","v":""},null,null,null,null,{"$f":"IOGIRIS!F30","v":""},null,null,null,null,null,null,null,null,null,null,null,null,null,null,null,null,null,null,{"$f":"IOGIRIS!U30","v":""},null,null,{"$f":"IOGIRIS!W30","v":""},null,null,null,{"$f":"F1form!I68","v":0},null,null,null,null,{"$f":"F1form!J68","v":0},null,null,null,null,null,null,null,null,null,null,null,null,null,null,null,null,null,null,{"$f":"F1form!K68","v":0},null,null,{"$f":"F1form!L68","v":0}]
[{"$f":"IOGIRIS!B31","v":""},null,null,null,null,{"$f":"IOGIRIS!F31","v":""},null,null,null,null,null,null,null,null,null,null,null,null,null,null,null,null,null,null,{"$f":"IOGIRIS!U31","v":""},null,null,{"$f":"IOGIRIS!W31","v":""},null,null,null,{"$f":"F1form!I69","v":0},null,null,null,null,{"$f":"F1form!J69","v":0},null,null,null,null,null,null,null,null,null,null,null,null,null,null,null,null,null,null,{"$f":"F1form!K69","v":0},null,null,{"$f":"F1form!L69","v":0}]
["TOPLAM",null,null,null,null,null,null,null,null,null,null,null,null,null,null,null,null,null,null,null,null,null,null,null,{"$f":"SUM(Y27:AA36)","v":0},null,null,{"$f":"SUM(AB27:AD36)","v":0},null,null,null,"TOPLAM",null,null,null,null,null,null,null,null,null,null,null,null,null,null,null,null,null,null,null,null,null,null,null,{"$f":"SUM(BD27:BF36)","v":0},null,null,{"$f":"SUM(BG27:BJ36)","v":0},null,null,null,null,null,null,null,null,null,null,null,null,null,null,null,null,"alabilir"]
[null,null,null,null,null,null,null,null,null,null,null,null,null,null,null,null,null,null,null,null,null,null,null,null,null,null,null,null,null,null,null,null,null,null,null,null,null,null,null,null,null,null,null,null,null,null,null,null,null,null,null,null,null,null,null,null,null,null,null,null,null,null,null,null,null,null,null,null,null,null,null,null,null,null,null,"uygu",null,null,"Zorunlu"]
["Çizelge 6- Yapılmayan Dersler",null,null,null,null,null,null,null,null,null,null,null,null,null,null,null,null,null,null,null,null,null,null,null,null,null,null,null,null,null,null,null,null,"Çizelge 8- Haftalık Ders Yükleri Dağılımı",null,null,null,null,null,null,null,null,null,null,null,null,null,null,null,null,null,null,null,null,null,null,null,null,null,null,null,null,null,"ak uy","ak teo","iki uy","iki teo",null,null,"ikili","aksam",null,null,null,null,"dig fa top","İKİLİ","AKSAM","ders"]
["Der.Kodu ve Adı",null,null,null,null,null,null,null,null,null,null,null,null,null,null,null,null,null,null,"Teo.",null,null,"Diğ.",null,null,"Y.Hafta",null,null,null,null,null,null,null,"1. Hafta",null,null,null,null,null,null,null,"Teo.",null,null,"Diğ.",null,null,"Zorunlu           Ders           Yükü",null,null,null,null,null,null,"Haftalık Ücrete Tabi Ders Yükü (10)**",null,null,null,null,null,null,null,null,{"$f":"$BT$21","v":0},{"$f":"$BT$20","v":0},{"$f":"IF(BX45<BL40,0,$BN$21)","v":0},{"$f":"IF(BX45<BL40,$BN$20,0)","v":0},null,null,null,null,null,null,null,null,null,{"$f":"IOGIRIS!$BP$17","v":0},{"$f":"IOGIRIS!$BQ$17","v":0}]
[{"$f":"IF(Z41=0,\"\",IOGIRIS!B36)","v":""},null,null,null,null,{"$f":"IF(Z41=0,\"\",IOGIRIS!F36)","v":""},null,null,null,null,null,null,null,null,null,null,null,null,null,{"$f":"IF(Z41=0,\"\",IOGIRIS!U36)","v":""},null,null,{"$f":"IF(Z41=0,\"\",IOGIRIS!W36)","v":""},null,null,{"$f":"IOGIRIS!Y36","v":0},null,null,null,null,null,null,null,"Haf.Ders Yükü",null,null,null,null,null,null,null,{"$f":"Y37","v":0},null,null,{"$f":"AB37","v":0},null,null,null,null,null,null,null,null,null,null,null,null,null,null,null,null,null,null,{"$f":"IF(BX45>BL40,BL40,BX45)","v":0},null,null,{"$f":"IF(BM42+BO40>10,BM42+BO40-10,BO40)","v":0}]
[{"$f":"IF(Z42=0,\"\",IOGIRIS!B37)","v":""},null,null,null,null,{"$f":"IF(Z42=0,\"\",IOGIRIS!F37)","v":""},null,null,null,null,null,null,null,null,null,null,null,null,null,{"$f":"IF(Z42=0,\"\",IOGIRIS!U37)","v":""},null,null,{"$f":"IF(Z42=0,\"\",IOGIRIS!W37)","v":""},null,null,{"$f":"IOGIRIS!Y37","v":0},null,null,null,null,null,null,null,"Ara Sın. Yükü",null,null,null,null,null,null,null,null,null,null,{"$f":"IOGIRIS!AS60","v":0},null,null,null,null,null,null,null,null,null,null,null,null,null,null,null,null,null,null,null,{"$f":"IF(BL41+BM40>10,10,IF(BL41+BM40+BL40>=BC45,BC45,(BL41+BM40)))","v":0},null,{"$f":"SUM(BO41,BM42)","v":0}]
[{"$f":"IF(Z43=0,\"\",IOGIRIS!B38)","v":""},null,null,null,null,{"$f":"IF(Z43=0,\"\",IOGIRIS!F38)","v":""},null,null,null,null,null,null,null,null,null,null,null,null,null,{"$f":"IF(Z43=0,\"\",IOGIRIS!U38)","v":""},null,null,{"$f":"IF(Z43=0,\"\",IOGIRIS!W38)","v":""},null,null,{"$f":"IOGIRIS!Y38","v":0},null,null,null,null,null,null,null,"Yapılmya Ders.",null,null,null,null,null,null,null,{"$f":"IOGIRIS!W60","v":0},null,null,{"$f":"IOGIRIS!X60","v":0}]
[{"$f":"IF(Z44=0,\"\",IOGIRIS!B39)","v":""},null,null,null,null,{"$f":"IF(Z44=0,\"\",IOGIRIS!F39)","v":""},null,null,null,null,null,null,null,null,null,null,null,null,null,{"$f":"IF(Z44=0,\"\",IOGIRIS!U39)","v":""},null,null,{"$f":"IF(Z44=0,\"\",IOGIRIS!W39)","v":""},null,null,{"$f":"IOGIRIS!Y39","v":0},null,null,null,null,null,null,null,"Ara Toplam",null,null,null,null,null,null,null,{"$f":"SUM(AP41,AP42)-AP43","v":0},null,null,{"$f":"SUM(AS41,AS42)-AS43","v":0}]
[{"$f":"IF(Z45=0,\"\",IOGIRIS!B40)","v":""},null,null,null,null,{"$f":"IF(Z45=0,\"\",IOGIRIS!F40)","v":""},null,null,null,null,null,null,null,null,null,null,null,null,null,{"$f":"IF(Z45=0,\"\",IOGIRIS!U40)","v":""},null,null,{"$f":"IF(Z45=0,\"\",IOGIRIS!W40)","v":""},null,null,{"$f":"IOGIRIS!Y40","v":0},null,null,null,null,null,null,null,"Haftalık Top.*",null,null,null,null,null,null,null,{"$f":" IF(AP44+AS44<1,0,IF(AP44+AS44>0,AP44+AS44))","v":0},null,null,null,null,null,{"$f":"$BA$3 +CA45","v":0},null,null,null,null,null,null,{"$f":"IF( (AP45-AV45)<0, 0, IF( (AP45-AV45)>10,10,(AP45-AV45)))","v":0},null,null,null,null,null,null,null,null,null,null,null,null,null,null,{"$f":"IF(CA45>0,CA45,IF(AP45<>0,BO41,0))","v":0},{"$f":"IF(BC45=0,0,IF(AP51<>0,BM48,0))","v":0},null,null,null,null,{"$f":"NorForm!BY45","v":0},null,{"$f":"IF(BC45>$BZ$40,$BZ$40,BC45)","v":0},{"$f":"NorForm!BL45","v":0}]
[{"$f":"IF(Z46=0,\"\",IOGIRIS!B41)","v":""},null,null,null,null,{"$f":"IF(Z46=0,\"\",IOGIRIS!F41)","v":""},null,null,null,null,null,null,null,null,null,null,null,null,null,{"$f":"IF(Z46=0,\"\",IOGIRIS!U41)","v":""},null,null,{"$f":"IF(Z46=0,\"\",IOGIRIS!W41)","v":""},null,null,{"$f":"IOGIRIS!Y41","v":0},null,null,null,null,null,null,null,"2. Hafta",null,null,null,null,null,null,null,"Teo.",null,null,"Diğ.",null,null,"Zorunlu           Ders           Yükü",null,null,null,null,null,null,"Haftalık Ücrete Tabi Ders Yükü (10)**",null,null,null,null,null,null,null,null,{"$f":"$BT$21","v":0},{"$f":"$BT$20","v":0},{"$f":"IF(BX51<BL46,0,$BN$21)","v":0},{"$f":"IF(BX51<BL46,$BN$20,0)","v":0}]
[{"$f":"IF(Z47=0,\"\",IOGIRIS!B42)","v":""},null,null,null,null,{"$f":"IF(Z47=0,\"\",IOGIRIS!F42)","v":""},null,null,null,null,null,null,null,null,null,null,null,null,null,{"$f":"IF(Z47=0,\"\",IOGIRIS!U42)","v":""},null,null,{"$f":"IF(Z47=0,\"\",IOGIRIS!W42)","v":""},null,null,{"$f":"IOGIRIS!Y42","v":0},null,null,null,null,null,null,null,"Haf.Ders Yükü",null,null,null,null,null,null,null,{"$f":"IF($BI$3>=2,AP41,0)","v":0},null,null,{"$f":"IF($BI$3>=2,AS41,0)","v":0},null,null,null,null,null,null,null,null,null,null,null,null,null,null,null,null,null,null,{"$f":"IF(BX51<BL46,BX51,BL46)","v":0},null,null,{"$f":"IF(BM48+BO46>10,BM48+BO46-10,BO46)","v":0}]
[{"$f":"IF(Z48=0,\"\",IOGIRIS!B43)","v":""},null,null,null,null,{"$f":"IF(Z48=0,\"\",IOGIRIS!F43)","v":""},null,null,null,null,null,null,null,null,null,null,null,null,null,{"$f":"IF(Z48=0,\"\",IOGIRIS!U43)","v":""},null,null,{"$f":"IF(Z48=0,\"\",IOGIRIS!W43)","v":""},null,null,{"$f":"IOGIRIS!Y43","v":0},null,null,null,null,null,null,null,"Ara Sın. Yükü",null,null,null,null,null,null,null,null,null,null,{"$f":"IOGIRIS!AV60","v":0},null,null,null,null,null,null,null,null,null,null,null,null,null,null,null,null,null,null,null,{"$f":"IF(BL47+BM46>10,10,IF(BL47+BM46+BL46>=BC51,BC51,(BL47+BM46)))","v":0},null,{"$f":"SUM(BO47,BM48)","v":0}]
[{"$f":"IF(Z49=0,\"\",IOGIRIS!B44)","v":""},null,null,null,null,{"$f":"IF(Z49=0,\"\",IOGIRIS!F44)","v":""},null,null,null,null,null,null,null,null,null,null,null,null,null,{"$f":"IF(Z49=0,\"\",IOGIRIS!U44)","v":""},null,null,{"$f":"IF(Z49=0,\"\",IOGIRIS!W44)","v":""},null,null,{"$f":"IOGIRIS!Y44","v":0},null,null,null,null,null,null,null,"Yapılmya Ders.",null,null,null,null,null,null,null,{"$f":"IOGIRIS!Z60","v":0},null,null,{"$f":"IOGIRIS!AA60","v":0}]
[{"$f":"IF(Z50=0,\"\",IOGIRIS!B45)","v":""},null,null,null,null,{"$f":"IF(Z50=0,\"\",IOGIRIS!F45)","v":""},null,null,null,null,null,null,null,null,null,null,null,null,null,{"$f":"IF(Z50=0,\"\",IOGIRIS!U45)","v":""},null,null,{"$f":"IF(Z50=0,\"\",IOGIRIS!W45)","v":""},null,null,{"$f":"IOGIRIS!Y45","v":0},null,null,null,null,null,null,null,"Ara Toplam",null,null,null,null,null,null,null,{"$f":"SUM(AP47,AP48)-AP49","v":0},null,null,{"$f":"SUM(AS47,AS48)-AS49","v":0}]
["TOPLAM",null,null,null,null,null,null,null,null,null,null,null,null,null,null,null,null,null,null,{"$f":"SUM(T41:V50)","v":0},null,null,{"$f":"SUM(W41:Y50)","v":0},null,null,null,null,null,null,null,null,null,null,"Haftalık Top.*",null,null,null,null,null,null,null,{"$f":" IF(AP50+AS50<1,0,IF(AP50+AS50>0,AP50+AS50))","v":0},null,null,null,null,null,{"$f":"$BA$3+CA51","v":0},null,null,null,null,null,null,{"$f":"IF( (AP51-AV51)<0, 0, IF( (AP51-AV51)>10,10,(AP51-AV51)))","v":0},null,null,null,null,null,null,null,null,null,null,null,null,null,null,{"$f":"IF(CA51>0,CA51,IF(AP51<>0,BO47,0))","v":0},{"$f":"IF(BC57=0,0,IF(AP57<>0,BM54,0))","v":0},null,null,null,null,{"$f":"NorForm!BY51","v":0},null,{"$f":"IF(BC51>$BZ$40,$BZ$40,BC51)","v":0},{"$f":"NorForm!BL51","v":0}]
[{"$f":"IOGIRIS!B47","v":0},null,null,null,null,{"$f":"IOGIRIS!F45","v":0},null,null,null,null,null,null,null,null,null,null,null,null,null,{"$f":"IOGIRIS!U45","v":0},null,null,{"$f":"IOGIRIS!W45","v":0},null,null,{"$f":"IOGIRIS!Y45","v":0},null,null,null,null,null,null,null,"3. Hafta",null,null,null,null,null,null,null,"Teo.",null,null,"Diğ.",null,null,"Zorunlu           Ders           Yükü",null,null,null,null,null,null,"Haftalık Ücrete Tabi Ders Yükü (10)**",null,null,null,null,null,null,null,null,{"$f":"$BT$21","v":0},{"$f":"$BT$20","v":0},{"$f":"IF(BX57<BL52,0,$BN$21)","v":0},{"$f":"IF(BX57<BL52,$BN$20,0)","v":0}]
[null,null,null,null,null,null,null,null,null,null,null,null,null,null,null,null,null,null,null,null,null,null,null,null,null,null,null,null,null,null,null,null,null,"Haf.Ders Yükü",null,null,null,null,null,null,null,{"$f":"IF($BI$3>=3,AP47,0)","v":0},null,null,{"$f":"IF($BI$3>=3,AS47,0)","v":0},null,null,null,null,null,null,null,null,null,null,null,null,null,null,null,null,null,null,{"$f":"IF(BX57<BL52,BX57,BL52)","v":0},null,null,{"$f":"IF(BM54+BO52>10,BM54+BO52-10,BO52)","v":0}]
[null,null,null,null,null,null,null,null,null,null,null,null,null,null,null,null,null,null,null,null,null,null,null,null,null,null,null,null,null,null,null,null,null,"Ara Sın. Yükü",null,null,null,null,null,null,null,null,null,null,{"$f":"IOGIRIS!AY60","v":0},null,null,null,null,null,null,null,null,null,null,null,null,null,null,null,null,null,null,null,{"$f":"IF(BL53+BM52>10,10,IF(BL53+BM52+BL52>=BC57,BC57,(BL53+BM52)))","v":0},null,{"$f":"SUM(BO53,BM54)","v":0}]
["Çizlge 7- Ara Sınavlar",null,null,null,null,null,null,null,null,null,null,null,null,null,null,null,null,null,null,null,null,null,null,null,null,null,null,null,null,null,null,null,null,"Yapılmya Ders.",null,null,null,null,null,null,null,{"$f":"IOGIRIS!AC60","v":0},null,null,{"$f":"IOGIRIS!AD60","v":0}]
["Der.Kodu ve Adı",null,null,null,null,null,null,null,null,null,null,null,null,null,null,null,null,"Tarih",null,null,null,null,"Öğr.Say.",null,null,null,"A.Sın.Yük.",null,null,null,null,null,null,"Ara Toplam",null,null,null,null,null,null,null,{"$f":"SUM(AP53,AP54)-AP55","v":0},null,null,{"$f":"SUM(AS53,AS54)-AS55","v":0}]
[{"$f":"IF(IOGIRIS!BF36<>\"\",IOGIRIS!AC36,\"\")","v":""},null,null,null,{"$f":"IF(A57<>\"\",IOGIRIS!AG36,\"\")","v":""},null,null,null,null,null,null,null,null,null,null,null,null,{"$f":"IF(A57<>\"\",IOGIRIS!AT36,\"\")","v":""},null,null,null,null,{"$f":"IF(A57<>\"\",IOGIRIS!AX36,\"\")","v":""},null,null,null,{"$f":"IF(A57<>\"\",IOGIRIS!BB36,\"\")","v":""},null,null,null,null,null,null,"Haftalık Top.*",null,null,null,null,null,null,null,{"$f":" IF(AP56+AS56<1,0,IF(AP56+AS56>0,AP56+AS56))","v":0},null,null,null,null,null,{"$f":"$BA$3+CA57","v":0},null,null,null,null,null,null,{"$f":"IF( (AP57-AV57)<0, 0, IF( (AP57-AV57)>10,10,(AP57-AV57)))","v":0},null,null,null,null,null,null,null,null,null,null,null,null,null,null,{"$f":"IF(CA57>0,CA57,IF(AP57<>0,BO53,0))","v":0},{"$f":"IF(BC63=0,0,IF(AP63<>0,BM60,0))","v":0},null,null,null,null,{"$f":"NorForm!BY57","v":0},null,{"$f":"IF(BC57>$BZ$40,$BZ$40,BC57)","v":0},{"$f":"NorForm!BL57","v":0}]
[{"$f":"IF(IOGIRIS!BF37<>\"\",IOGIRIS!AC37,\"\")","v":""},null,null,null,{"$f":"IF(A58<>\"\",IOGIRIS!AG37,\"\")","v":""},null,null,null,null,null,null,null,null,null,null,null,null,{"$f":"IF(A58<>\"\",IOGIRIS!AT37,\"\")","v":""},null,null,null,null,{"$f":"IF(A58<>\"\",IOGIRIS!AX37,\"\")","v":""},null,null,null,{"$f":"IF(A58<>\"\",IOGIRIS!BB37,\"\")","v":""},null,null,null,null,null,null,"4. Hafta",null,null,null,null,null,null,null,"Teo.",null,null,"Diğ.",null,null,"Zorunlu           Ders           Yükü",null,null,null,null,null,null,"Haftalık Ücrete Tabi Ders Yükü (10)**",null,null,null,null,null,null,null,null,{"$f":"$BT$21","v":0},{"$f":"$BT$20","v":0},{"$f":"IF(BX63<BL58,0,$BN$21)","v":0},{"$f":"IF(BX63<BL58,$BN$20,0)","v":0}]
[{"$f":"IF(IOGIRIS!BF38<>\"\",IOGIRIS!AC38,\"\")","v":""},null,null,null,{"$f":"IF(A59<>\"\",IOGIRIS!AG38,\"\")","v":""},null,null,null,null,null,null,null,null,null,null,null,null,{"$f":"IF(A59<>\"\",IOGIRIS!AT38,\"\")","v":""},null,null,null,null,{"$f":"IF(A59<>\"\",IOGIRIS!AX38,\"\")","v":""},null,null,null,{"$f":"IF(A59<>\"\",IOGIRIS!BB38,\"\")","v":""},null,null,null,null,null,null,"Haf.Ders Yükü",null,null,null,null,null,null,null,{"$f":"IF($BI$3>=4,AP53,0)","v":0},null,null,{"$f":"IF($BI$3>=4,AS53,0)","v":0},null,null,null,null,null,null,null,null,null,null,null,null,null,null,null,null,null,null,{"$f":"IF(BX63<BL58,BX63,BL58)","v":0},null,null,{"$f":"IF(BM60+BO58>10,BM60+BO58-10,BO58)","v":0}]
[{"$f":"IF(IOGIRIS!BF39<>\"\",IOGIRIS!AC39,\"\")","v":""},null,null,null,{"$f":"IF(A60<>\"\",IOGIRIS!AG39,\"\")","v":""},null,null,null,null,null,null,null,null,null,null,null,null,{"$f":"IF(A60<>\"\",IOGIRIS!AT39,\"\")","v":""},null,null,null,null,{"$f":"IF(A60<>\"\",IOGIRIS!AX39,\"\")","v":""},null,null,null,{"$f":"IF(A60<>\"\",IOGIRIS!BB39,\"\")","v":""},null,null,null,null,null,null,"Ara Sın. Yükü",null,null,null,null,null,null,null,null,null,null,{"$f":"IOGIRIS!BB60","v":0},null,null,null,null,null,null,null,null,null,null,null,null,null,null,null,null,null,null,null,{"$f":"IF(BL59+BM58>10,10,IF(BL59+BM58+BL58>=BC63,BC63,(BL59+BM58)))","v":0},null,{"$f":"SUM(BO59,BM60)","v":0}]
[{"$f":"IF(IOGIRIS!BF40<>\"\",IOGIRIS!AC40,\"\")","v":""},null,null,null,{"$f":"IF(A61<>\"\",IOGIRIS!AG40,\"\")","v":""},null,null,null,null,null,null,null,null,null,null,null,null,{"$f":"IF(A61<>\"\",IOGIRIS!AT40,\"\")","v":""},null,null,null,null,{"$f":"IF(A61<>\"\",IOGIRIS!AX40,\"\")","v":""},null,null,null,{"$f":"IF(A61<>\"\",IOGIRIS!BB40,\"\")","v":""},null,null,null,null,null,null,"Yapılmya Ders.",null,null,null,null,null,null,null,{"$f":"IOGIRIS!AF60","v":0},null,null,{"$f":"IOGIRIS!AG60","v":0}]
[{"$f":"IF(IOGIRIS!BF41<>\"\",IOGIRIS!AC41,\"\")","v":""},null,null,null,{"$f":"IF(A62<>\"\",IOGIRIS!AG41,\"\")","v":""},null,null,null,null,null,null,null,null,null,null,null,null,{"$f":"IF(A62<>\"\",IOGIRIS!AT41,\"\")","v":""},null,null,null,null,{"$f":"IF(A62<>\"\",IOGIRIS!AX41,\"\")","v":""},null,null,null,{"$f":"IF(A62<>\"\",IOGIRIS!BB41,\"\")","v":""},null,null,null,null,null,null,"Ara Toplam",null,null,null,null,null,null,null,{"$f":"SUM(AP59,AP60)-AP61","v":0},null,null,{"$f":"SUM(AS59,AS60)-AS61","v":0}]
[{"$f":"IF(IOGIRIS!BF42<>\"\",IOGIRIS!AC42,\"\")","v":""},null,null,null,{"$f":"IF(A63<>\"\",IOGIRIS!AG42,\"\")","v":""},null,null,null,null,null,null,null,null,null,null,null,null,{"$f":"IF(A63<>\"\",IOGIRIS!AT42,\"\")","v":""},null,null,null,null,{"$f":"IF(A63<>\"\",IOGIRIS!AX42,\"\")","v":""},null,null,null,{"$f":"IF(A63<>\"\",IOGIRIS!BB42,\"\")","v":""},null,null,null,null,null,null,"Haftalık Top.*",null,null,null,null,null,null,null,{"$f":" IF(AP62+AS62<1,0,IF(AP62+AS62>0,AP62+AS62))","v":0},null,null,null,null,null,{"$f":"$BA$3+CA63","v":0},null,null,null,null,null,null,{"$f":"IF( (AP63-AV63)<0, 0, IF( (AP63-AV63)>10,10,(AP63-AV63)))","v":0},null,null,null,null,null,null,null,null,null,null,null,null,null,null,{"$f":"IF(CA63>0,CA63,IF(AP63<>0,BO59,0))","v":0},{"$f":"IF(BC63=0,0,IF(AP63<>0,BM60,0))","v":0},null,null,null,null,{"$f":"NorForm!BY63","v":0},null,{"$f":"IF(BC63>$BZ$40,$BZ$40,BC63)","v":0},{"$f":"NorForm!BL63","v":0}]
[{"$f":"IF(IOGIRIS!BF43<>\"\",IOGIRIS!AC43,\"\")","v":""},null,null,null,{"$f":"IF(A64<>\"\",IOGIRIS!AG43,\"\")","v":""},null,null,null,null,null,null,null,null,null,null,null,null,{"$f":"IF(A64<>\"\",IOGIRIS!AT43,\"\")","v":""},null,null,null,null,{"$f":"IF(A64<>\"\",IOGIRIS!AX43,\"\")","v":""},null,null,null,{"$f":"IF(A64<>\"\",IOGIRIS!BB43,\"\")","v":""},null,null,null,null,null,null,"5. Hafta",null,null,null,null,null,null,null,"Teo.",null,null,"Diğ.",null,null,"Zorunlu           Ders           Yükü",null,null,null,null,null,null,"Haftalık Ücrete Tabi Ders Yükü (10)**",null,null,null,null,null,null,null,null,{"$f":"$BT$21","v":0},{"$f":"$BT$20","v":0},{"$f":"IF(BX69<BL64,0,$BN$21)","v":0},{"$f":"IF(BX69<BL64,$BN$20,0)","v":0}]
[{"$f":"IF(IOGIRIS!BF44<>\"\",IOGIRIS!AC44,\"\")","v":""},null,null,null,{"$f":"IF(A65<>\"\",IOGIRIS!AG44,\"\")","v":""},null,null,null,null,null,null,null,null,null,null,null,null,{"$f":"IF(A65<>\"\",IOGIRIS!AT44,\"\")","v":""},null,null,null,null,{"$f":"IF(A65<>\"\",IOGIRIS!AX44,\"\")","v":""},null,null,null,{"$f":"IF(A65<>\"\",IOGIRIS!BB44,\"\")","v":""},null,null,null,null,null,null,"Haf.Ders Yükü",null,null,null,null,null,null,null,{"$f":"IF($BI$3>=5,AP59,0)","v":0},null,null,{"$f":"IF($BI$3>=5,AS59,0)","v":0},null,null,null,null,null,null,null,null,null,null,null,null,null,null,null,null,null,null,{"$f":"IF(BX69<BL64,BX69,BL64)","v":0},null,null,{"$f":"IF(BM66+BO64>10,BM66+BO64-10,BO64)","v":0}]
[{"$f":"IF(IOGIRIS!BF45<>\"\",IOGIRIS!AC45,\"\")","v":""},null,null,null,{"$f":"IF(A66<>\"\",IOGIRIS!AG45,\"\")","v":""},null,null,null,null,null,null,null,null,null,null,null,null,{"$f":"IF(A66<>\"\",IOGIRIS!AT45,\"\")","v":""},null,null,null,null,{"$f":"IF(A66<>\"\",IOGIRIS!AX45,\"\")","v":""},null,null,null,{"$f":"IF(A66<>\"\",IOGIRIS!BB45,\"\")","v":""},null,null,null,null,null,null,"Ara Sın. Yükü",null,null,null,null,null,null,null,null,null,null,{"$f":"IOGIRIS!BE60","v":0},null,null,null,null,null,null,null,null,null,null,null,null,null,null,null,null,null,null,null,{"$f":"IF(BL65+BM64>10,10,IF(BL65+BM64+BL64>=BC69,BC69,(BL65+BM64)))","v":0},null,{"$f":"SUM(BO65,BM66)","v":0}]
["TOPLAM",null,null,null,null,null,null,null,null,null,null,null,null,null,null,null,null,null,null,null,null,null,null,null,null,null,{"$f":"SUM(AA57:AE66)","v":0},null,null,null,null,null,null,"Yapılmya Ders.",null,null,null,null,null,null,null,{"$f":"IOGIRIS!AI60","v":0},null,null,{"$f":"IOGIRIS!AJ60","v":0}]
[null,null,null,null,null,null,null,null,null,null,null,null,null,null,null,null,null,null,null,null,null,null,null,null,null,null,null,null,null,null,null,null,null,null,null,null,null,null,null,null,null,{"$f":"SUM(AP65,AP66)-AP67","v":0},null,null,{"$f":"SUM(AS65,AS66)-AS67","v":0}]
[null,null,null,null,null,null,null,null,null,null,null,null,null,null,null,null,null,null,null,null,null,null,null,null,null,null,null,null,null,null,null,null,null,"Haftalık Top.*",null,null,null,null,null,null,null,{"$f":" IF(AP68+AS68<1,0,IF(AP68+AS68>0,AP68+AS68))","v":0},null,null,null,null,null,{"$f":"$BA$3+CA69","v":0},null,null,null,null,null,null,{"$f":"IF( (AP69-AV69)<0, 0, IF( (AP69-AV69)>10,10,(AP69-AV69)))","v":0},null,null,null,null,null,null,null,null,null,null,null,null,null,null,{"$f":"IF(CA69>0,CA69,IF(AP69<>0,BO65,0))","v":0},{"$f":"IF(BC69=0,0,IF(AP69<>0,BM66,0))","v":0},null,null,null,null,{"$f":"NorForm!BY69","v":0},null,{"$f":"IF(BC69>$BZ$40,$BZ$40,BC69)","v":0},{"$f":"NorForm!BL69","v":0}]
[null,null,null,null,null,null,null,null,null,null,null,null,null,null,null,null,null,{"$f":"MONTH('Bilgi-27'!N15)","v":9},null,null,{"$f":"MONTH('Bilgi-27'!T15)","v":10},null,null,null,null,null,null,null,null,null,null,null,null,"AYLIK ÜCRETE TABİ DERS YÜKÜ (Saat/Ay)",null,null,null,null,null,null,null,null,null,null,null,null,null,null,null,null,null,null,null,null,{"$f":"SUM(BC45,BC51,BC57,BC63,BC69)","v":0}]
[null,null,null,null,null,null,null,null,null,null,null,null,null,null,null,null,null,null,null,null,null,null,null,null,null,null,null,null,null,null,null,null,null,null,null,null,null,null,null,null,null,null,null,null,null,null,null,null,null,null,null,null,null,null,null,null,null,null,null,null,null,null,null,null,null,null,null,null,null,{"$f":"SUM(BR69,BR63,BR57,BR51,BR45)","v":0},{"$f":"SUM(BS69,BS63,BS57,BS51,BS45)","v":0},null,null,null,null,null,null,{"$f":"SUM(BZ45,BZ51,BZ57,BZ63,BZ69)","v":0},{"$f":"SUM(CA45,CA51,CA57,CA63,CA69)","v":0}]
[null,null,"İlgili Öğretim Elemanınca",null,null,null,null,null,null,null,null,null,null,null,{"$f":"'Bilgi-27'!N15","v":"2025-09-27"},null,null,{"$f":"IF(R70=U70,\"\",\"/\")","v":"/"},{"$f":"IF(R70=U70,\"\",'Bilgi-27'!T15)","v":"2025-10-01"},null,{"$f":"O72","v":"2025-09-27"},null,null,"ayında toplam",null,null,null,null,null,null,{"$f":"CL72","v":0},null,"(",{"$f":"sayi(AE72)","v":" Sıfır "},null,null,null,null,")","saat ders okutulmuş olup, bunun",null,null,null,null,null,null,null,null,null,null,null,null,null,null,null,null,null,null,null,null,null,null,null,null,null,null,null,null,null,null,{"$f":"SUM(BR71:BS71)","v":0},null,null,null,null,null,null,null,null,{"$f":"SUM(BZ71:CA71)","v":0},null,null,null,null,"Top.oku.Ders",null,null,null,null,{"$f":"IF(CK72=0,SUM(AP45,AP51,AP57,AP63,AP69),CK72)","v":0}]
[{"$f":"CL73","v":0},null,"(",{"$f":"sayi(A73)","v":" Sıfır "},null,null,null,null,")","saatinden ücret talep edilmektedir.",null,null,null,null,null,null,null,null,null,null,null,null,null,null,null,null,{"$f":"\"Bu  derslerden \"&CL74&\" ( \"&sayi(CL74)&\" )  saat  mesai  saati  içinde, geri kalan \"","v":"Bu  derslerden 5 ( Beş )  saat  mesai  saati  içinde, geri kalan "},null,null,null,null,null,null,null,null,null,null,null,null,null,null,null,null,null,null,null,null,null,null,null,null,null,null,null,null,null,null,null,null,null,null,null,null,null,null,null,null,null,null,null,null,null,null,null,null,null,null,null,null,null,null,null,null,null,"Ücrete tabi Ders",null,null,null,null,{"$f":"IF(CK73=0,BC70,CK73)","v":0}]
[{"$f":"CL75","v":5},null,"(",{"$f":"sayi(CL75)","v":"Beş"},null,null,null,null,")","saat ders mesai  saati dışında okutulmaktadır.",null,null,null,null,null,null,null,null,null,null,null,null,null,null,null,null,null,null,null,null,null,null,null,null,null,null,null,null,null,null,null,null,null,null,null,null,null,null,null,null,null,null,null,null,null,null,null,null,null,null,null,null,null,null,null,null,null,null,null,null,null,null,null,null,null,null,null,null,null,null,null,null,null,null,"17 den once",null,null,null,5,{"$f":"IF(CK74=0,BR71,CK74)","v":5}]
["*",null,"Diğer faaliyetler (Normal Öğretim + İkinci Öğretim 10 saati geçemez.)",null,null,null,null,null,null,null,null,null,null,null,null,null,null,null,null,null,null,null,null,null,null,null,null,null,null,null,null,null,null,null,null,null,null,null,null,null,null,null,null,null,null,null,null,null,null,null,null,null,null,null,null,null,null,null,null,null,null,null,null,null,null,null,null,null,null,null,null,null,null,null,null,null,null,null,null,null,null,null,null,null,"17 den sonra",null,null,null,5,{"$f":"IF(CK75=0,BZ71,CK75)","v":5}]
["**",null,"Haftalık ücrete tabi ders yükü (Normal Öğretim için 20 saati geçemez)"]
[]
[null,null,null,null,"Bildiri Sahibi",null,null,null,null,null,null,null,null,null,null,null,null,null,null,"Bölüm Başkanı",null,null,null,null,null,null,null,null,null,null,null,null,null,null,null,null,null,null,null,null,null,null,null,null,{"$f":"'Bilgi-27'!Z11","v":"Müdür"}]
[null,{"$f":"I3","v":"Öğr.Gör. Celalettin AYDIN"},null,null,null,null,null,null,null,null,null,null,null,null,null,null,null,null,null,{"$f":"'Bilgi-27'!Z13","v":"Ögr. Gör. Celalettin AYDIN"},null,null,null,null,null,null,null,null,null,null,null,null,null,null,null,null,null,null,null,null,null,null,null,null,{"$f":"'Bilgi-27'!Z12","v":"Prof. Dr. Mutlu AVCI"}]

{"sheet":"SINAV","index":8,"n_rows":31,"n_cols":18,"rows_kept":31,"cut":false,"hidden":false,"merged":[[1,0,1,6],[2,0,2,6],[25,4,25,6],[1,7,1,13],[2,7,2,13],[7,7,7,8],[8,7,8,8],[20,7,20,12],[25,11,25,13],[20,0,20,5],[7,0,7,1],[8,0,8,1]]}
[]
[{"$f":"'Bilgi-27'!Z6","v":"Ç.Ü. CEyhan Meslek Yüksekokulu"},null,null,null,null,null,null,{"$f":"A2","v":"Ç.Ü. CEyhan Meslek Yüksekokulu"},null,null,null,null,null,null,null,"Normal Ö. Puan",null,300]
["SINAV DÖNEMİ SINAV ÜCRET BİLDİRİMİ",null,null,null,null,null,null,"SINAV DÖNEMİ SINAV ÜCRET BİLDİRİMİ",null,null,null,null,null,null,null,"İkinci   Ö. Puan",null,600]
[]
[]
["Sınav Dönemi:","HAZİRAN   2021 (FİNAL)",null,null,"NORMAL","ÖĞRETİM",null,"Sınav Dönemi:",{"$f":"B6","v":"HAZİRAN   2021 (FİNAL)"},null,null,"İKİNCİ","ÖĞRETİM"]
[]
["Sınavı Yapılan Dersin ",null,"Sınav Tarihi","Öğrenci ","Katsayısı","Puanı","Toplam","Sınavı Yapılan Dersin ",null,"Sınav Tarihi","Öğrenci ","Katsayısı","Puanı","Toplam"]
["Kodu  ve Adı",null,null,"Sayısı",null,null,null,"Kodu  ve Adı",null,null,"Sayısı"]
[{"$f":"F1form!C15","v":"BLP 157"},{"$f":"F1form!D15","v":"Web Tasarımının Temelleri"},null,{"$f":"F1form!F15","v":69},{"$f":"IF(D10<1,0,IF(D10<51,1,IF(D10<101,2,IF(D10<151,3,IF(D10<201,4,IF(D10<251,5,IF(D10<301,6,IF(D10<351,7,8))))))))","v":2},{"$f":"IF(E10=0,0,$R$2)","v":300},{"$f":"IF(F10=0,0,E10*F10)","v":600},{"$f":"F1form!C31","v":0},{"$f":"F1form!D31","v":0},null,{"$f":"F1form!F31","v":0},{"$f":"IF(K10<1,0,IF(K10<51,1,IF(K10<101,2,IF(K10<151,3,IF(K10<201,4,IF(K10<251,5,IF(K10<301,6,IF(K10<351,7,8))))))))","v":0},{"$f":"IF(L10=0,0,$R$3)","v":0},{"$f":"IF(M10=0,0,L10*M10)","v":0}]
[{"$f":"F1form!C16","v":"BLP 215"},{"$f":"F1form!D16","v":"Sensörler"},null,{"$f":"F1form!F16","v":57},{"$f":"IF(D11<1,0,IF(D11<51,1,IF(D11<101,2,IF(D11<151,3,IF(D11<201,4,IF(D11<251,5,IF(D11<301,6,IF(D11<351,7,8))))))))","v":2},{"$f":"IF(E11=0,0,$R$2)","v":300},{"$f":"IF(F11=0,0,E11*F11)","v":600},{"$f":"F1form!C32","v":0},{"$f":"F1form!D32","v":0},null,{"$f":"F1form!F32","v":0},0,{"$f":"IF(L11=0,0,$R$3)","v":0},{"$f":"IF(M11=0,0,L11*M11)","v":0}]
[{"$f":"F1form!C17","v":0},{"$f":"F1form!D17","v":0},null,{"$f":"F1form!F17","v":0},{"$f":"IF(D12<1,0,IF(D12<51,1,IF(D12<101,2,IF(D12<151,3,IF(D12<201,4,IF(D12<251,5,IF(D12<301,6,IF(D12<351,7,8))))))))","v":0},0,0,{"$f":"F1form!C33","v":0},{"$f":"F1form!D33","v":0},null,{"$f":"F1form!F33","v":0},0,0,0]
[{"$f":"F1form!C18","v":0},{"$f":"F1form!D18","v":0},null,{"$f":"F1form!F18","v":0},{"$f":"IF(D13<1,0,IF(D13<51,1,IF(D13<101,2,IF(D13<151,3,IF(D13<201,4,IF(D13<251,5,IF(D13<301,6,IF(D13<351,7,8))))))))","v":0},0,0,{"$f":"F1form!C34","v":0},{"$f":"F1form!D34","v":0},null,{"$f":"F1form!F34","v":0},0,0,0]
[{"$f":"F1form!C19","v":0},{"$f":"F1form!D19","v":0},null,{"$f":"F1form!F19","v":0},{"$f":"IF(D14<1,0,IF(D14<51,1,IF(D14<101,2,IF(D14<151,3,IF(D14<201,4,IF(D14<251,5,IF(D14<301,6,IF(D14<351,7,8))))))))","v":0},0,0,{"$f":"F1form!C35","v":0},{"$f":"F1form!D35","v":0},null,{"$f":"F1form!F35","v":0},0,0,0]
[{"$f":"F1form!C20","v":0},{"$f":"F1form!D20","v":0},null,{"$f":"F1form!F20","v":0},{"$f":"IF(D15<1,0,IF(D15<51,1,IF(D15<101,2,IF(D15<151,3,IF(D15<201,4,IF(D15<251,5,IF(D15<301,6,IF(D15<351,7,8))))))))","v":0},0,0,{"$f":"F1form!C36","v":0},{"$f":"F1form!D36","v":0},null,{"$f":"F1form!F36","v":0},0,0,0]
[{"$f":"F1form!C21","v":0},{"$f":"F1form!D21","v":0},null,{"$f":"F1form!F21","v":0},0,0,0,{"$f":"F1form!C37","v":0},{"$f":"F1form!D37","v":0},null,{"$f":"F1form!F37","v":0},0,0,0]
[{"$f":"F1form!C22","v":0},{"$f":"F1form!D22","v":0},null,{"$f":"F1form!F22","v":0},0,0,0,{"$f":"F1form!C38","v":0},{"$f":"F1form!D38","v":0},null,{"$f":"F1form!F38","v":0},0,0,0]
[{"$f":"F1form!C23","v":0},{"$f":"F1form!D23","v":0},null,{"$f":"F1form!F23","v":0},0,0,0,{"$f":"F1form!C39","v":0},{"$f":"F1form!D39","v":0},null,{"$f":"F1form!F39","v":0},0,0,0]
[{"$f":"F1form!C24","v":0},{"$f":"F1form!D24","v":0},null,{"$f":"F1form!F24","v":0},0,0,0,{"$f":"F1form!C40","v":0},{"$f":"F1form!D40","v":0},null,{"$f":"F1form!F40","v":0},0,0,0]
[null,null,null,null,0,0,0,null,null,null,null,0,{"$f":"IF(L20=0,0,600)","v":0},0]
["Genel Toplam :",null,null,null,null,null,{"$f":"SUM(G10:G20)","v":1200},"Genel Toplam :",null,null,null,null,null,{"$f":"SUM(N10:N20)","v":0}]
[]
[]
["Bildirimi Verenin",null,null,"Bölüm Başkanı",null,null,null,"Bildirimi Verenin",null,null,"Bölüm Başkanı"]
[]
["Adı Soyadı    :",{"$f":"F1form!E8","v":"Öğr.Gör. Celalettin AYDIN"},null,"Adı Soyadı    :",{"$f":"'Bilgi-27'!Z13","v":"Ögr. Gör. Celalettin AYDIN"},null,null,"Adı Soyadı    :",{"$f":"B26","v":"Öğr.Gör. Celalettin AYDIN"},null,"Adı Soyadı    :",{"$f":"E26","v":"Ögr. Gör. Celalettin AYDIN"}]
["İmzası           :",null,null,"İmzası            :",null,null,null,"İmzası           :",null,null,"İmzası            :"]
[]
[]
[null,null,"ONAY",null,null,null,null,null,null,"ONAY"]
[null,null,"......./........./............",null,null,null,null,null,null,"......./........./............"]

{"sheet":"SINAVFORM","index":9,"n_rows":31,"n_cols":14,"rows_kept":31,"cut":false,"hidden":false,"merged":[[1,0,1,6],[1,7,1,13],[2,0,2,6],[2,7,2,13],[7,0,7,1],[7,7,7,8],[8,0,8,1],[8,7,8,8],[20,0,20,5],[20,7,20,12],[25,4,25,6],[25,11,25,13]]}
[]
[{"$f":"SINAV!A2","v":"Ç.Ü. CEyhan Meslek Yüksekokulu"},null,null,null,null,null,null,{"$f":"A2","v":"Ç.Ü. CEyhan Meslek Yüksekokulu"}]
["SINAV DÖNEMİ SINAV ÜCRET BİLDİRİMİ",null,null,null,null,null,null,"SINAV DÖNEMİ SINAV ÜCRET BİLDİRİMİ"]
[]
[]
["Sınav Dönemi:",{"$f":"SINAV!B6","v":"HAZİRAN   2021 (FİNAL)"},null,null,"NORMAL","ÖĞRETİM",null,"Sınav Dönemi:",{"$f":"B6","v":"HAZİRAN   2021 (FİNAL)"},null,null,"İKİNCİ","ÖĞRETİM"]
[]
["Sınavı Yapılan Dersin ",null,"Sınav Tarihi","Öğrenci ","Katsayısı","Puanı","Toplam","Sınavı Yapılan Dersin ",null,"Sınav Tarihi","Öğrenci ","Katsayısı","Puanı","Toplam"]
["Kodu  ve Adı",null,null,"Sayısı",null,null,null,"Kodu  ve Adı",null,null,"Sayısı"]
[{"$f":"F1form!C15","v":"BLP 157"},{"$f":"F1form!D15","v":"Web Tasarımının Temelleri"},{"$f":"SINAV!C10","v":"00:00:00"},{"$f":"F1form!F15","v":69},{"$f":"IF(D10>100,3,IF(D10>50,2,IF(D10>0,1,0)))","v":2},{"$f":"IF(E10=0,0,SINAV!$F$10)","v":300},{"$f":"IF(F10=0,0,E10*F10)","v":600},{"$f":"F1form!C31","v":0},{"$f":"F1form!D31","v":0},{"$f":"SINAV!J10","v":"00:00:00"},{"$f":"F1form!F31","v":0},{"$f":"IF(K10>100,3,IF(K10>50,2,IF(K10>0,1,0)))","v":0},{"$f":"IF(L10=0,0,SINAV!$M$10)","v":0},{"$f":"IF(M10=0,0,L10*M10)","v":0}]
[{"$f":"F1form!C16","v":"BLP 215"},{"$f":"F1form!D16","v":"Sensörler"},{"$f":"SINAV!C11","v":"00:00:00"},{"$f":"F1form!F16","v":57},{"$f":"IF(D11>100,3,IF(D11>50,2,IF(D11>0,1,0)))","v":2},{"$f":"IF(E11=0,0,SINAV!$F$10)","v":300},{"$f":"IF(F11=0,0,E11*F11)","v":600},{"$f":"F1form!C32","v":0},{"$f":"F1form!D32","v":0},{"$f":"SINAV!J11","v":"00:00:00"},{"$f":"F1form!F32","v":0},{"$f":"IF(K11>100,3,IF(K11>50,2,IF(K11>0,1,0)))","v":0},{"$f":"IF(L11=0,0,SINAV!$M$10)","v":0},{"$f":"IF(M11=0,0,L11*M11)","v":0}]
[{"$f":"F1form!C17","v":0},{"$f":"F1form!D17","v":0},{"$f":"SINAV!C12","v":"00:00:00"},{"$f":"F1form!F17","v":0},0,{"$f":"IF(E12=0,0,SINAV!$F$10)","v":0},0,{"$f":"F1form!C33","v":0},{"$f":"F1form!D33","v":0},{"$f":"SINAV!J12","v":"00:00:00"},{"$f":"F1form!F33","v":0},0,{"$f":"IF(L12=0,0,SINAV!$M$10)","v":0},0]
[{"$f":"F1form!C18","v":0},{"$f":"F1form!D18","v":0},{"$f":"SINAV!C13","v":"00:00:00"},{"$f":"F1form!F18","v":0},0,{"$f":"IF(E13=0,0,SINAV!$F$10)","v":0},0,{"$f":"F1form!C34","v":0},{"$f":"F1form!D34","v":0},{"$f":"SINAV!J13","v":"00:00:00"},{"$f":"F1form!F34","v":0},0,{"$f":"IF(L13=0,0,SINAV!$M$10)","v":0},0]
[{"$f":"F1form!C19","v":0},{"$f":"F1form!D19","v":0},{"$f":"SINAV!C14","v":"00:00:00"},{"$f":"F1form!F19","v":0},0,{"$f":"IF(E14=0,0,SINAV!$F$10)","v":0},0,{"$f":"F1form!C35","v":0},{"$f":"F1form!D35","v":0},{"$f":"SINAV!J14","v":"00:00:00"},{"$f":"F1form!F35","v":0},0,{"$f":"IF(L14=0,0,SINAV!$M$10)","v":0},0]
[{"$f":"F1form!C20","v":0},{"$f":"F1form!D20","v":0},{"$f":"SINAV!C15","v":"00:00:00"},{"$f":"F1form!F20","v":0},0,{"$f":"IF(E15=0,0,SINAV!$F$10)","v":0},0,{"$f":"F1form!C36","v":0},{"$f":"F1form!D36","v":0},{"$f":"SINAV!J15","v":"00:00:00"},{"$f":"F1form!F36","v":0},0,{"$f":"IF(L15=0,0,SINAV!$M$10)","v":0},0]
[{"$f":"F1form!C21","v":0},{"$f":"F1form!D21","v":0},{"$f":"SINAV!C16","v":"00:00:00"},{"$f":"F1form!F21","v":0},0,{"$f":"IF(E16=0,0,SINAV!$F$10)","v":0},0,{"$f":"F1form!C37","v":0},{"$f":"F1form!D37","v":0},{"$f":"SINAV!J16","v":"00:00:00"},{"$f":"F1form!F37","v":0},0,{"$f":"IF(L16=0,0,SINAV!$M$10)","v":0},0]
[{"$f":"F1form!C22","v":0},{"$f":"F1form!D22","v":0},{"$f":"SINAV!C17","v":"00:00:00"},{"$f":"F1form!F22","v":0},0,{"$f":"IF(E17=0,0,SINAV!$F$10)","v":0},0,{"$f":"F1form!C38","v":0},{"$f":"F1form!D38","v":0},{"$f":"SINAV!J17","v":"00:00:00"},{"$f":"F1form!F38","v":0},0,{"$f":"IF(L17=0,0,SINAV!$M$10)","v":0},0]
[{"$f":"F1form!C23","v":0},{"$f":"F1form!D23","v":0},{"$f":"SINAV!C18","v":"00:00:00"},{"$f":"F1form!F23","v":0},0,{"$f":"IF(E18=0,0,SINAV!$F$10)","v":0},0,{"$f":"F1form!C39","v":0},{"$f":"F1form!D39","v":0},{"$f":"SINAV!J18","v":"00:00:00"},{"$f":"F1form!F39","v":0},0,{"$f":"IF(L18=0,0,SINAV!$M$10)","v":0},0]
[{"$f":"F1form!C24","v":0},{"$f":"F1form!D24","v":0},{"$f":"SINAV!C19","v":"00:00:00"},{"$f":"F1form!F24","v":0},0,{"$f":"IF(E19=0,0,SINAV!$F$10)","v":0},0,{"$f":"F1form!C40","v":0},{"$f":"F1form!D40","v":0},{"$f":"SINAV!J19","v":"00:00:00"},{"$f":"F1form!F40","v":0},0,{"$f":"IF(L19=0,0,SINAV!$M$10)","v":0},0]
[null,null,null,null,0,{"$f":"IF(E20=0,0,SINAV!$F$10)","v":0},0,null,null,null,null,{"$f":"IF(K20>100,3,IF(K20>50,2,IF(K20>0,1,0)))","v":0},{"$f":"IF(L20=0,0,SINAV!$M$10)","v":0},0]
["Genel Toplam :",null,null,null,null,null,{"$f":"SUM(G10:G20)","v":1200},"Genel Toplam :",null,null,null,null,null,{"$f":"SUM(N10:N20)","v":0}]
[]
[]
["Bildirimi Verenin",null,null,"Bölüm Başkanı",null,null,null,"Bildirimi Verenin",null,null,"Bölüm Başkanı"]
[]
["Adı Soyadı    :",{"$f":"F1form!E8","v":"Öğr.Gör. Celalettin AYDIN"},null,"Adı Soyadı    :",{"$f":"SINAV!E26","v":"Ögr. Gör. Celalettin AYDIN"},null,null,"Adı Soyadı    :",{"$f":"B26","v":"Öğr.Gör. Celalettin AYDIN"},null,"Adı Soyadı    :",{"$f":"E26","v":"Ögr. Gör. Celalettin AYDIN"}]
["İmzası           :",null,null,"İmzası            :",null,null,null,"İmzası           :",null,null,"İmzası            :"]
[]
[]
[null,null,"ONAY",null,null,null,null,null,null,"ONAY"]
[null,null,"......./........./............",null,null,null,null,null,null,"......./........./............"]

{"sheet":"F1formp","index":10,"n_rows":50,"n_cols":18,"rows_kept":50,"cut":false,"hidden":false,"merged":[[7,14,8,16],[8,2,8,3],[8,4,8,8],[4,7,4,9],[0,0,0,17],[1,0,1,17],[2,0,2,17],[3,0,3,17],[6,2,6,16],[7,2,7,3],[7,4,7,8],[7,9,8,10],[7,11,8,12],[7,13,8,13],[49,11,49,14],[49,3,49,6],[9,2,9,3],[9,4,9,8],[9,9,9,16],[11,7,13,7],[11,8,11,14],[40,4,40,5],[41,4,41,5],[11,16,13,16],[24,3,24,4],[14,3,14,4],[15,3,15,4],[16,3,16,4],[11,0,27,0],[11,1,13,1],[11,2,11,4],[11,5,13,5],[11,6,13,6],[22,3,22,4],[23,3,23,4],[25,3,25,4],[26,3,26,4],[27,3,27,4],[17,3,17,4],[18,3,18,4],[19,3,19,4],[20,3,20,4],[21,3,21,4],[11,17,13,17],[12,2,13,2],[12,3,13,4],[12,8,13,8],[12,9,13,9],[12,10,13,10],[12,11,13,11],[12,12,12,13],[12,14,13,14],[11,15,13,15],[30,0,39,0],[30,3,30,4],[31,3,31,4],[32,3,32,4],[33,3,33,4],[34,3,34,4],[35,3,35,4],[36,3,36,4],[37,3,37,4],[38,3,38,4],[39,3,39,4]]}
["T.C"]
["ÇUKUROVA ÜNİVERSİTESİ"]
[]
["ÖĞRETİM ELEMANI DERS YÜKÜ FORMU   (F-1)"]
[null,null,null,null,null,null,{"$f":"F1form!G5","v":"2025-2026"},"  EĞİTİM ÖĞRETİM YILI",null,null,{"$f":"F1form!K5","v":"GÜZ"},"YARIYILI"]
[]
[null,null,"ÖĞRETİM ELEMANININ"]
[null,null,"ÜNVANI, ADI SOYADI",null,{"$f":"F1form!E8","v":"Öğr.Gör. Celalettin AYDIN"},null,null,null,null,"İDARİ GÖREVİ :",null,{"$f":"F1form!L8","v":0},null,"İMZASI  :"]
[null,null,"KURUM",null,{"$f":"F1form!E9","v":"Ç.Ü. CEyhan Meslek Yüksekokulu"}]
[null,null,"BÖLÜM",null,{"$f":"F1form!E10","v":"Bilgisayar Bölümü"}]
[]
["ÖRGÜN ÖĞRETİM","SIRA NO","ÖĞRETİM ÇALIŞMASININ",null,null,"ÖĞRENCİ SAYISI","FAKÜLTE/ENST./YO/MYO/BÖLÜM","TEORİK DERSLER","DİĞER FAALİYETLER",null,null,null,null,null,null,"DERS YÜKÜ","ZORUNLU DERS YUKU","ÖDENECEK SAAT"]
[null,null,"KODU","ADI",null,null,null,null,"UYGULAMA","LABARA.","SEMİNER","BİTİRME ÇALIŞMASI","TEZ YÖNETİMİ",null,"ARA SINAV"]
[null,null,null,null,null,null,null,null,null,null,null,null,"Y.LİSANS","DOKTORA"]
[null,1,{"$f":"F1form!C15","v":"BLP 157"},{"$f":"F1form!D15","v":"Web Tasarımının Temelleri"},null,{"$f":"F1form!F15","v":69},{"$f":"F1form!G15","v":"CMYO"},{"$f":"F1form!H15","v":2},{"$f":"F1form!I15","v":0},{"$f":"F1form!J15","v":0},{"$f":"F1form!K15","v":0},{"$f":"F1form!L15","v":0},{"$f":"F1form!M15","v":0},{"$f":"F1form!N15","v":0},{"$f":"F1form!O15","v":0},{"$f":"F1form!P15","v":2},{"$f":"F1form!R15","v":0},{"$f":"F1form!S15","v":0}]
[null,2,{"$f":"F1form!C16","v":"BLP 215"},{"$f":"F1form!D16","v":"Sensörler"},null,{"$f":"F1form!F16","v":57},{"$f":"F1form!G16","v":"CMYO"},{"$f":"F1form!H16","v":2},{"$f":"F1form!I16","v":0},{"$f":"F1form!J16","v":0},{"$f":"F1form!K16","v":0},{"$f":"F1form!L16","v":0},{"$f":"F1form!M16","v":0},{"$f":"F1form!N16","v":0},{"$f":"F1form!O16","v":0},{"$f":"F1form!P16","v":2},{"$f":"F1form!R16","v":0},{"$f":"F1form!S16","v":0}]
[null,3,{"$f":"F1form!C17","v":0},{"$f":"F1form!D17","v":0},null,{"$f":"F1form!F17","v":0},{"$f":"F1form!G17","v":0},{"$f":"F1form!H17","v":0},{"$f":"F1form!I17","v":0},{"$f":"F1form!J17","v":0},{"$f":"F1form!K17","v":0},{"$f":"F1form!L17","v":0},{"$f":"F1form!M17","v":0},{"$f":"F1form!N17","v":0},{"$f":"F1form!O17","v":0},{"$f":"F1form!P17","v":0},{"$f":"F1form!R17","v":0},{"$f":"F1form!S17","v":0}]
[null,4,{"$f":"F1form!C18","v":0},{"$f":"F1form!D18","v":0},null,{"$f":"F1form!F18","v":0},{"$f":"F1form!G18","v":0},{"$f":"F1form!H18","v":0},{"$f":"F1form!I18","v":0},{"$f":"F1form!J18","v":0},{"$f":"F1form!K18","v":0},{"$f":"F1form!L18","v":0},{"$f":"F1form!M18","v":0},{"$f":"F1form!N18","v":0},{"$f":"F1form!O18","v":0},{"$f":"F1form!P18","v":0},{"$f":"F1form!R18","v":0},{"$f":"F1form!S18","v":0}]
[null,5,{"$f":"F1form!C19","v":0},{"$f":"F1form!D19","v":0},null,{"$f":"F1form!F19","v":0},{"$f":"F1form!G19","v":0},{"$f":"F1form!H19","v":0},{"$f":"F1form!I19","v":0},{"$f":"F1form!J19","v":0},{"$f":"F1form!K19","v":0},{"$f":"F1form!L19","v":0},{"$f":"F1form!M19","v":0},{"$f":"F1form!N19","v":0},{"$f":"F1form!O19","v":0},{"$f":"F1form!P19","v":0},{"$f":"F1form!R19","v":0},{"$f":"F1form!S19","v":0}]
[null,6,{"$f":"F1form!C20","v":0},{"$f":"F1form!D20","v":0},null,{"$f":"F1form!F20","v":0},{"$f":"F1form!G20","v":0},{"$f":"F1form!H20","v":0},{"$f":"F1form!I20","v":0},{"$f":"F1form!J20","v":0},{"$f":"F1form!K20","v":0},{"$f":"F1form!L20","v":0},{"$f":"F1form!M20","v":0},{"$f":"F1form!N20","v":0},{"$f":"F1form!O20","v":0},{"$f":"F1form!P20","v":0},{"$f":"F1form!R20","v":0},{"$f":"F1form!S20","v":0}]
[null,7,{"$f":"F1form!C21","v":0},{"$f":"F1form!D21","v":0},null,{"$f":"F1form!F21","v":0},{"$f":"F1form!G21","v":0},{"$f":"F1form!H21","v":0},{"$f":"F1form!I21","v":0},{"$f":"F1form!J21","v":0},{"$f":"F1form!K21","v":0},{"$f":"F1form!L21","v":0},{"$f":"F1form!M21","v":0},{"$f":"F1form!N21","v":0},{"$f":"F1form!O21","v":0},{"$f":"F1form!P21","v":0},{"$f":"F1form!R21","v":0},{"$f":"F1form!S21","v":0}]
[null,8,{"$f":"F1form!C22","v":0},{"$f":"F1form!D22","v":0},null,{"$f":"F1form!F22","v":0},{"$f":"F1form!G22","v":0},{"$f":"F1form!H22","v":0},{"$f":"F1form!I22","v":0},{"$f":"F1form!J22","v":0},{"$f":"F1form!K22","v":0},{"$f":"F1form!L22","v":0},{"$f":"F1form!M22","v":0},{"$f":"F1form!N22","v":0},{"$f":"F1form!O22","v":0},{"$f":"F1form!P22","v":0},{"$f":"F1form!R22","v":0},{"$f":"F1form!S22","v":0}]
[null,9,{"$f":"F1form!C23","v":0},{"$f":"F1form!D23","v":0},null,{"$f":"F1form!F23","v":0},{"$f":"F1form!G23","v":0},{"$f":"F1form!H23","v":0},{"$f":"F1form!I23","v":0},{"$f":"F1form!J23","v":0},{"$f":"F1form!K23","v":0},{"$f":"F1form!L23","v":0},{"$f":"F1form!M23","v":0},{"$f":"F1form!N23","v":0},{"$f":"F1form!O23","v":0},{"$f":"F1form!P23","v":0},{"$f":"F1form!R23","v":0},{"$f":"F1form!S23","v":0}]
[null,10,{"$f":"F1form!C24","v":0},{"$f":"F1form!D24","v":0},null,{"$f":"F1form!F24","v":0},{"$f":"F1form!G24","v":0},{"$f":"F1form!H24","v":0},{"$f":"F1form!I24","v":0},{"$f":"F1form!J24","v":0},{"$f":"F1form!K24","v":0},{"$f":"F1form!L24","v":0},{"$f":"F1form!M24","v":0},{"$f":"F1form!N24","v":0},{"$f":"F1form!O24","v":0},{"$f":"F1form!P24","v":0},{"$f":"F1form!R24","v":0},{"$f":"F1form!S24","v":0}]
[null,11,{"$f":"F1form!C25","v":0},{"$f":"F1form!D25","v":0},null,{"$f":"F1form!F25","v":0},{"$f":"F1form!G25","v":0},{"$f":"F1form!H25","v":0},{"$f":"F1form!I25","v":0},{"$f":"F1form!J25","v":0},{"$f":"F1form!K25","v":0},{"$f":"F1form!L25","v":0},{"$f":"F1form!M25","v":0},{"$f":"F1form!N25","v":0},{"$f":"F1form!O25","v":0},{"$f":"F1form!P25","v":0},{"$f":"F1form!R25","v":0},{"$f":"F1form!S25","v":0}]
[null,12,{"$f":"F1form!C26","v":0},{"$f":"F1form!D26","v":0},null,{"$f":"F1form!F26","v":0},{"$f":"F1form!G26","v":0},{"$f":"F1form!H26","v":0},{"$f":"F1form!I26","v":0},{"$f":"F1form!J26","v":0},{"$f":"F1form!K26","v":0},{"$f":"F1form!L26","v":0},{"$f":"F1form!M26","v":0},{"$f":"F1form!N26","v":0},{"$f":"F1form!O26","v":0},{"$f":"F1form!P26","v":0},{"$f":"F1form!R26","v":0},{"$f":"F1form!S26","v":0}]
[null,13,{"$f":"F1form!C27","v":0},{"$f":"F1form!D27","v":0},null,{"$f":"F1form!F27","v":0},{"$f":"F1form!G27","v":0},{"$f":"F1form!H27","v":0},{"$f":"F1form!I27","v":0},{"$f":"F1form!J27","v":0},{"$f":"F1form!K27","v":0},{"$f":"F1form!L27","v":0},{"$f":"F1form!M27","v":0},{"$f":"F1form!N27","v":0},{"$f":"F1form!O27","v":0},{"$f":"F1form!P27","v":0},{"$f":"F1form!R27","v":0},{"$f":"F1form!S27","v":0}]
[null,14,{"$f":"F1form!C28","v":"  "},{"$f":"F1form!D28","v":0},null,{"$f":"F1form!F28","v":0},{"$f":"F1form!G28","v":0},{"$f":"F1form!H28","v":0},{"$f":"F1form!I28","v":0},{"$f":"F1form!J28","v":0},{"$f":"F1form!K28","v":0},{"$f":"F1form!L28","v":0},{"$f":"F1form!M28","v":0},{"$f":"F1form!N28","v":0},{"$f":"F1form!O28","v":0},{"$f":"F1form!P28","v":0},{"$f":"F1form!R28","v":0},{"$f":"F1form!S28","v":0}]
[null,null,null,null,"ÖRGÜN ÖĞRETİM TOPLAMI",null,null,{"$f":"SUM(H15:H28)","v":4},0,0,0,0,0,0,0,4,0,0]
[]
["II. ÖĞRETİM",1,{"$f":"F1form!C31","v":0},{"$f":"F1form!D31","v":0},null,{"$f":"F1form!F31","v":0},{"$f":"F1form!G31","v":0},{"$f":"F1form!H31","v":0},{"$f":"F1form!I31","v":0},{"$f":"F1form!J31","v":0},{"$f":"F1form!K31","v":0},{"$f":"F1form!L31","v":0},{"$f":"F1form!M31","v":0},{"$f":"F1form!N31","v":0},{"$f":"F1form!O31","v":0},{"$f":"F1form!P31","v":0},{"$f":"F1form!R31","v":0},{"$f":"F1form!S31","v":0}]
[null,2,{"$f":"F1form!C32","v":0},{"$f":"F1form!D32","v":0},null,{"$f":"F1form!F32","v":0},{"$f":"F1form!G32","v":0},{"$f":"F1form!H32","v":0},{"$f":"F1form!I32","v":0},{"$f":"F1form!J32","v":0},{"$f":"F1form!K32","v":0},{"$f":"F1form!L32","v":0},{"$f":"F1form!M32","v":0},{"$f":"F1form!N32","v":0},{"$f":"F1form!O32","v":0},{"$f":"F1form!P32","v":0},{"$f":"F1form!R32","v":0},{"$f":"F1form!S32","v":0}]
[null,3,{"$f":"F1form!C33","v":0},{"$f":"F1form!D33","v":0},null,{"$f":"F1form!F33","v":0},{"$f":"F1form!G33","v":0},{"$f":"F1form!H33","v":0},{"$f":"F1form!I33","v":0},{"$f":"F1form!J33","v":0},{"$f":"F1form!K33","v":0},{"$f":"F1form!L33","v":0},{"$f":"F1form!M33","v":0},{"$f":"F1form!N33","v":0},{"$f":"F1form!O33","v":0},{"$f":"F1form!P33","v":0},{"$f":"F1form!R33","v":0},{"$f":"F1form!S33","v":0}]
[null,4,{"$f":"F1form!C34","v":0},{"$f":"F1form!D34","v":0},null,{"$f":"F1form!F34","v":0},{"$f":"F1form!G34","v":0},{"$f":"F1form!H34","v":0},{"$f":"F1form!I34","v":0},{"$f":"F1form!J34","v":0},{"$f":"F1form!K34","v":0},{"$f":"F1form!L34","v":0},{"$f":"F1form!M34","v":0},{"$f":"F1form!N34","v":0},{"$f":"F1form!O34","v":0},{"$f":"F1form!P34","v":0},{"$f":"F1form!R34","v":0},{"$f":"F1form!S34","v":0}]
[null,5,{"$f":"F1form!C35","v":0},{"$f":"F1form!D35","v":0},null,{"$f":"F1form!F35","v":0},{"$f":"F1form!G35","v":0},{"$f":"F1form!H35","v":0},{"$f":"F1form!I35","v":0},{"$f":"F1form!J35","v":0},{"$f":"F1form!K35","v":0},{"$f":"F1form!L35","v":0},{"$f":"F1form!M35","v":0},{"$f":"F1form!N35","v":0},{"$f":"F1form!O35","v":0},{"$f":"F1form!P35","v":0},{"$f":"F1form!R35","v":0},{"$f":"F1form!S35","v":0}]
[null,6,{"$f":"F1form!C36","v":0},{"$f":"F1form!D36","v":0},null,{"$f":"F1form!F36","v":0},{"$f":"F1form!G36","v":0},{"$f":"F1form!H36","v":0},{"$f":"F1form!I36","v":0},{"$f":"F1form!J36","v":0},{"$f":"F1form!K36","v":0},{"$f":"F1form!L36","v":0},{"$f":"F1form!M36","v":0},{"$f":"F1form!N36","v":0},{"$f":"F1form!O36","v":0},{"$f":"F1form!P36","v":0},{"$f":"F1form!R36","v":0},{"$f":"F1form!S36","v":0}]
[null,7,{"$f":"F1form!C37","v":0},{"$f":"F1form!D37","v":0},null,{"$f":"F1form!F37","v":0},{"$f":"F1form!G37","v":0},{"$f":"F1form!H37","v":0},{"$f":"F1form!I37","v":0},{"$f":"F1form!J37","v":0},{"$f":"F1form!K37","v":0},{"$f":"F1form!L37","v":0},{"$f":"F1form!M37","v":0},{"$f":"F1form!N37","v":0},{"$f":"F1form!O37","v":0},{"$f":"F1form!P37","v":0},{"$f":"F1form!R37","v":0},{"$f":"F1form!S37","v":0}]
[null,8,{"$f":"F1form!C38","v":0},{"$f":"F1form!D38","v":0},null,{"$f":"F1form!F38","v":0},{"$f":"F1form!G38","v":0},{"$f":"F1form!H38","v":0},{"$f":"F1form!I38","v":0},{"$f":"F1form!J38","v":0},{"$f":"F1form!K38","v":0},{"$f":"F1form!L38","v":0},{"$f":"F1form!M38","v":0},{"$f":"F1form!N38","v":0},{"$f":"F1form!O38","v":0},{"$f":"F1form!P38","v":0},{"$f":"F1form!R38","v":0},{"$f":"F1form!S38","v":0}]
[null,9,{"$f":"F1form!C39","v":0},{"$f":"F1form!D39","v":0},null,{"$f":"F1form!F39","v":0},{"$f":"F1form!G39","v":0},{"$f":"F1form!H39","v":0},{"$f":"F1form!I39","v":0},{"$f":"F1form!J39","v":0},{"$f":"F1form!K39","v":0},{"$f":"F1form!L39","v":0},{"$f":"F1form!M39","v":0},{"$f":"F1form!N39","v":0},{"$f":"F1form!O39","v":0},{"$f":"F1form!P39","v":0},{"$f":"F1form!R39","v":0},{"$f":"F1form!S39","v":0}]
[null,10,{"$f":"F1form!C40","v":0},{"$f":"F1form!D40","v":0},null,{"$f":"F1form!F40","v":0},{"$f":"F1form!G40","v":0},{"$f":"F1form!H40","v":0},{"$f":"F1form!I40","v":0},{"$f":"F1form!J40","v":0},{"$f":"F1form!K40","v":0},{"$f":"F1form!L40","v":0},{"$f":"F1form!M40","v":0},{"$f":"F1form!N40","v":0},{"$f":"F1form!O40","v":0},{"$f":"F1form!P40","v":0},{"$f":"F1form!R40","v":0},{"$f":"F1form!S40","v":0}]
[null,null,null,null,"II.ÖĞRETİM TOPLAMI",null,null,{"$f":"SUM(H31:H40)","v":0},{"$f":"SUM(I31:I40)","v":0},{"$f":"SUM(J31:J40)","v":0},0,0,0,0,0,0,0,0]
[null,null,null,null,"GENEL TOPLAM",null,null,{"$f":"SUM(H29+H41)","v":4},0,0,0,0,0,0,0,4,0,0]
[]
[null,null,null,null,null,null,{"$f":"F1form!G44","v":"MÜDÜRLÜK"}]
[]
[null,null,"Yukarıda ünvanı, adı, soyadı yazılı öğretim elemanının formda beyanı yapılan öğretim çalışmalarını gerçekleştirme ve ders yükü çalışmaları karşılığında kendisine ek ders ücreti "]
[null,"ödenmesini 2914 sayılı kanunun 11. maddesi gereğince onaylarınıza arz ederim."]
[null,null,null,null,"......../....../.........",null,null,null,null,null,null,null,"......../....../........."]
[null,null,null,null,"BÖLÜM BAŞKANI",null,null,null,null,null,null,null,"UYGUNDUR"]
[null,null,null,{"$f":"F1form!D50","v":"Ögr. Gör. Celalettin AYDIN"},null,null,null,null,null,null,null,{"$f":"F1form!L50","v":"Prof. Dr. Mutlu AVCI"}]

{"sheet":"Ekders formu-Y","index":11,"n_rows":77,"n_cols":65,"rows_kept":77,"cut":false,"hidden":false,"merged":[[76,3,78,10],[76,11,78,17],[76,18,78,26],[70,0,70,15],[70,16,70,19],[70,20,70,23],[70,24,70,33],[71,16,71,19],[71,20,71,23],[71,24,71,33],[68,56,68,64],[69,0,69,15],[69,16,69,19],[69,20,69,23],[69,24,69,33],[69,46,69,52],[69,56,69,64],[68,0,68,15],[68,16,68,19],[68,20,68,23],[68,24,68,33],[68,36,68,43],[68,46,68,52],[66,35,67,45],[66,46,67,53],[66,54,67,63],[67,0,67,15],[67,16,67,19],[67,20,67,23],[67,24,67,33],[65,0,65,15],[65,16,65,19],[65,20,65,23],[65,24,65,33],[66,0,66,15],[66,16,66,19],[66,20,66,23],[66,24,66,33],[64,0,64,15],[64,16,64,19],[64,20,64,23],[64,24,64,33],[64,47,64,52],[64,57,64,64],[58,0,58,17],[58,29,58,33],[58,42,58,45],[59,29,59,33],[61,31,61,32],[62,0,63,15],[62,24,63,33],[55,65,56,67],[56,0,56,17],[56,18,56,23],[56,24,56,28],[56,29,56,33],[57,0,57,17],[57,18,57,23],[57,24,57,28],[57,29,57,33],[52,0,52,17],[52,18,52,23],[52,24,52,28],[52,29,52,33],[52,35,53,42],[52,45,53,52],[50,50,50,52],[50,53,50,55],[53,65,54,67],[54,0,54,17],[54,18,54,23],[54,24,54,28],[54,29,54,33],[54,62,55,64],[55,0,55,17],[55,18,55,23],[55,24,55,28],[55,29,55,33],[52,59,53,61],[52,62,53,64],[53,0,53,17],[53,18,53,23],[53,24,53,28],[53,29,53,33],[50,56,50,58],[51,0,51,17],[51,18,51,23],[51,24,51,28],[51,29,51,33],[51,43,51,44],[51,45,51,47],[51,48,51,49],[49,50,49,52],[49,53,49,55],[49,56,49,58],[50,0,50,17],[50,18,50,23],[50,24,50,28],[50,29,50,33],[50,43,50,44],[50,45,50,47],[50,48,50,49],[51,50,51,52],[51,53,51,55],[49,43,49,44],[49,45,49,47],[49,48,49,49],[46,0,46,12],[46,13,46,14],[46,15,46,16],[46,17,46,29],[46,30,46,31],[46,32,46,33],[44,59,45,61],[44,62,45,64],[44,65,45,67],[45,13,45,14],[45,15,45,16],[45,30,45,31],[45,32,45,33],[46,43,48,44],[47,35,47,42],[48,35,48,42],[44,0,45,10],[44,13,44,14],[44,15,44,16],[44,17,45,27],[44,30,44,31],[44,32,44,33],[44,35,45,42],[44,45,45,52],[42,0,43,10],[42,13,42,14],[42,15,42,16],[42,17,43,27],[42,30,42,31],[42,32,42,33],[43,13,43,14],[43,15,43,16],[43,30,43,31],[43,32,43,33],[43,50,43,52],[43,53,43,55],[43,59,43,61],[42,43,42,44],[42,45,42,47],[42,48,42,49],[42,50,42,52],[42,53,42,55],[42,56,42,58],[43,43,43,44],[43,45,43,47],[43,48,43,49],[41,43,41,44],[41,45,41,47],[41,48,41,49],[41,50,41,52],[41,53,41,55],[41,56,41,58],[40,32,40,33],[40,35,40,42],[41,0,41,12],[41,13,41,14],[41,15,41,16],[41,17,41,29],[41,30,41,31],[41,32,41,33],[38,43,40,44],[39,0,39,12],[39,13,39,14],[39,15,39,16],[39,17,39,29],[39,30,39,31],[39,32,39,33],[39,35,39,42],[40,0,40,12],[40,13,40,14],[40,15,40,16],[40,17,40,29],[40,30,40,31],[35,0,35,12],[35,13,35,14],[35,15,35,16],[35,17,35,29],[35,30,35,31],[35,32,35,33],[38,0,38,12],[38,13,38,14],[38,15,38,16],[38,17,38,29],[38,30,38,31],[38,32,38,33],[36,0,36,12],[36,13,36,14],[36,15,36,16],[36,17,36,29],[36,30,36,31],[36,32,36,33],[37,65,37,67],[36,35,37,42],[36,45,37,52],[36,59,37,61],[36,62,37,64],[37,0,37,12],[37,13,37,14],[37,15,37,16],[37,17,37,29],[37,30,37,31],[37,32,37,33],[35,43,35,44],[35,45,35,47],[35,48,35,49],[33,56,33,58],[34,0,34,12],[34,13,34,14],[34,15,34,16],[34,17,34,29],[34,30,34,31],[34,32,34,33],[34,43,34,44],[34,45,34,47],[34,48,34,49],[33,32,33,33],[33,43,33,44],[33,45,33,47],[33,48,33,49],[33,50,33,52],[33,53,33,55],[34,50,34,52],[34,53,34,55],[34,56,34,58],[35,50,35,52],[35,53,35,55],[32,15,32,16],[32,17,32,29],[32,30,32,31],[32,32,32,33],[32,35,32,42],[33,0,33,12],[33,13,33,14],[33,15,33,16],[33,17,33,29],[33,30,33,31],[28,59,29,61],[28,62,29,64],[29,0,29,12],[29,13,29,14],[29,15,29,16],[29,17,29,29],[29,30,29,31],[29,32,29,33],[30,43,32,44],[31,0,31,12],[31,13,31,14],[31,15,31,16],[31,17,31,29],[31,30,31,31],[31,32,31,33],[31,35,31,42],[32,0,32,12],[32,13,32,14],[30,0,30,12],[30,13,30,14],[30,15,30,16],[30,17,30,29],[30,30,30,31],[30,32,30,33],[27,43,27,44],[27,45,27,47],[27,48,27,49],[27,50,27,52],[27,53,27,55],[28,0,28,12],[28,13,28,14],[28,15,28,16],[28,17,28,29],[28,30,28,31],[27,0,27,12],[27,13,27,14],[27,15,27,16],[27,17,27,29],[27,30,27,31],[27,32,27,33],[28,32,28,33],[28,45,29,52],[26,43,26,44],[26,45,26,47],[26,48,26,49],[26,50,26,52],[26,53,26,55],[26,56,26,58],[26,0,26,12],[26,13,26,14],[26,15,26,16],[26,17,26,29],[26,30,26,31],[26,32,26,33],[25,43,25,44],[25,45,25,47],[25,48,25,49],[25,50,25,52],[25,53,25,55],[25,56,25,58],[24,13,24,16],[24,30,24,33],[24,35,24,42],[25,13,25,14],[25,15,25,16],[25,30,25,31],[25,32,25,33],[21,65,22,67],[22,43,24,44],[23,35,23,42],[20,59,21,61],[20,62,21,64],[21,0,22,2],[21,3,22,5],[21,6,22,8],[21,9,22,11],[21,12,22,14],[21,15,22,17],[21,18,22,20],[21,21,22,23],[19,0,20,2],[19,3,20,5],[19,6,20,8],[19,9,20,11],[19,12,20,14],[19,15,20,17],[19,45,19,47],[19,48,19,49],[19,50,19,52],[19,53,19,55],[20,35,21,42],[20,45,21,52],[19,18,20,20],[19,21,20,23],[19,24,20,26],[19,27,20,30],[19,31,20,33],[19,43,19,44],[21,24,22,26],[21,27,22,30],[21,31,22,33],[17,45,17,47],[15,31,16,33],[15,35,15,42],[16,35,16,42],[17,48,17,49],[17,50,17,52],[17,53,17,55],[17,56,17,58],[18,43,18,44],[18,45,18,47],[18,48,18,49],[18,50,18,52],[18,53,18,55],[18,56,18,58],[13,31,14,33],[14,43,16,44],[15,18,16,20],[15,21,16,23],[15,24,16,26],[15,27,16,30],[17,0,18,2],[17,3,18,5],[17,6,18,8],[17,9,18,11],[17,12,18,14],[17,15,18,17],[17,18,18,20],[15,0,16,2],[15,3,16,5],[15,6,16,8],[15,9,16,11],[15,12,16,14],[15,15,16,17],[17,21,18,23],[17,24,18,26],[17,27,18,30],[17,31,18,33],[17,43,17,44],[13,0,14,2],[13,3,14,5],[13,6,14,8],[13,9,14,11],[13,12,14,14],[13,15,14,17],[12,21,12,23],[12,24,12,26],[12,27,12,30],[13,18,14,20],[13,21,14,23],[13,24,14,26],[13,27,14,30],[12,31,12,33],[12,62,12,64],[12,65,12,67],[12,3,12,5],[12,6,12,8],[12,9,12,11],[12,12,12,14],[12,15,12,17],[12,18,12,20],[9,3,9,12],[9,20,9,27],[9,32,9,33],[11,23,11,32],[11,62,11,64],[11,65,11,67],[7,3,7,8],[7,12,7,15],[7,16,7,30],[8,3,8,6],[8,7,8,17],[8,18,8,29],[8,30,8,33],[4,9,4,26],[4,27,4,33],[4,34,4,41],[5,9,5,26],[5,27,5,33],[5,34,5,41],[1,2,5,8],[1,9,1,26],[1,27,1,33],[1,34,1,41],[2,9,2,26],[2,27,2,33],[2,34,2,41],[3,9,3,26],[3,27,3,33],[3,34,3,41]]}
[]
[null,null,{"$error":"#VALUE!"},null,null,null,null,null,null,"T.C.",null,null,null,null,null,null,null,null,null,null,null,null,null,null,null,null,null,"DOKÜMAN NO",null,null,null,null,null,null,"FRM-SGDB-0007"]
[null,null,null,null,null,null,null,null,null,"ÇUKUROVA ÜNİVERSİTESİ",null,null,null,null,null,null,null,null,null,null,null,null,null,null,null,null,null,"İLK YAYIN TARİHİ",null,null,null,null,null,null,"2024-07-16"]
[null,null,null,null,null,null,null,null,null,"CEYHAN MÜHENDİSLİK FAKÜLTESİ",null,null,null,null,null,null,null,null,null,null,null,null,null,null,null,null,null,"REVİZYON TARİHİ"]
[null,null,null,null,null,null,null,null,null,null,null,null,null,null,null,null,null,null,null,null,null,null,null,null,null,null,null,"REVİZYON NO"]
[null,null,null,null,null,null,null,null,null,"EK DERS BİLDİRİM FORMU",null,null,null,null,null,null,null,null,null,null,null,null,null,null,null,null,null,"SAYFA NO",null,null,null,null,null,null,"1/1"]
[]
["Ünvanı",null,null,null,null,null,null,null,null,"Adı Soyadı",null,null,null,null,null,null,null,null,null,null,null,null,null,null,null,null,null,null,null,null,null,null,null,null,null,"Günler",null,null,29,30,1,2,3,4,5,6,7,8,9,10,11,12,13,14,15,16,17,18,19,20,21,22,23,24,25]
["İdari Görevi",null,null,null,null,null,null,null,null,null,null,null,null,null,null,null,null,null,"Zorunlu Ders Yükü",null,null,null,null,null,null,null,null,null,null,null,null,null,null,null,null,"Teorik"]
["Bölüm :",null,null,null,null,null,null,null,null,null,null,null,null,"Kapsadığı Dönem",null,null,null,null,null,null,null,null,null,null,null,null,null,null,"Hafta Sayısı",null,null,null,null,null,null,"Uygulama"]
["EK-1b",null,null,null,null,null,null,null,null,null,null,null,null,null,null,null,null,null,null,null,null,null,null,null,null,null,null,null,null,null,null,null,null,null,null,"Günler",null,null,null,26,27,28,29,30,31,null,null,null,null,null,null,null,null,null,null,null,null,null,null,null,null,null,"TOPLAM"]
["Çizelge 1. HAFTALIK DERS PROGRAMI",null,null,null,null,null,null,null,null,null,null,null,null,null,null,null,null,"Kapsadığı Sömestre :",null,null,null,null,null,null,null,null,null,null,null,null,null,null,null,null,null,"Teorik"]
["Günler",null,null,"8.15-9.00",null,null,"9.15-10.00",null,null,"10.15-11.00",null,null,"11.15-12.00",null,null,"13.15-14.00",null,null,"14.15-15.00",null,null,"15.15-16.00",null,null,"16.15-17.00",null,null,"17.15-18.00",null,null,null,null,null,null,null,"Uygulama"]
["Pazartesi",null,null,null,null,null,null,null,null,null,null,null,null,null,null,null,null,null,null,null,null,null,null,null,null,null,null,null,null,null,null,null,null,null,null,"Çizelge 5. HAFTALARA GÖRE DERS YÜKLERİNİN DAĞILIMI"]
[null,null,null,null,null,null,null,null,null,null,null,null,null,null,null,null,null,null,null,null,null,null,null,null,null,null,null,null,null,null,null,null,null,null,null,"Tarih",null,null,null,null,null,null,null,"Teori  Ders",null,null,"Diğer Faaliyetler",null,null,null,null,null,null,null,null,null,null,null,null,null,null,null,"1.Hafta"]
["Salı",null,null,null,null,null,null,null,null,null,null,null,null,null,null,null,null,null,null,null,null,null,null,null,null,null,null,null,null,null,null,null,null,null,null,null,null,null,null,null,null,null,null,null,null,"Y.Lisans",null,null,"Staj",null,"Mezuniyet",null,null,"Uygula",null,null,"Ara Sınav",null,null,null,null,null,"ücrete "]
[null,null,null,null,null,null,null,null,null,null,null,null,null,null,null,null,null,null,null,null,null,null,null,null,null,null,null,null,null,null,null,null,null,null,null,null,null,null,null,null,null,null,null,null,null,"Doktora",null,null,null,null,"Çalışm.",null,null,null,null,null,null,null,null,"Zorunlu",null,null,"tabi"]
["Çarşamba",null,null,null,null,null,null,null,null,null,null,null,null,null,null,null,null,null,null,null,null,null,null,null,null,null,null,null,null,null,null,null,null,null,null,"Tüm Dersler",null,null,null,null,null,null,null,null,null,null,null,null,null,null,null,null,null,null,null,null,null,null,null,"Ders",null,null,"ders"]
[null,null,null,null,null,null,null,null,null,null,null,null,null,null,null,null,null,null,null,null,null,null,null,null,null,null,null,null,null,null,null,null,null,null,null,"Yapılamayan Dersler",null,null,null,null,null,null,null,null,null,null,null,null,null,null,null,null,null,null,null,null,null,null,null,"Yükü",null,null,"Yükü"]
["Perşembe",null,null,null,null,null,null,null,null,null,null,null,null,null,null,null,null,null,null,null,null,null,null,null,null,null,null,null,null,null,null,null,null,null,null,"Yapılan Dersler",null,null,null,null,null,null,null,null,null,null,null,null,null,null,null,null,null,null,null,null,{"$f":"SUM(BE18)","v":0},"(10)*",null,{"$f":"SUM(AT21)-BH21","v":0},null,null,null,"(20)**"]
[null,null,null,null,null,null,null,null,null,null,null,null,null,null,null,null,null,null,null,null,null,null,null,null,null,null,null,null,null,null,null,null,null,null,null,"Haftalık Toplam"]
["Cuma"]
[null,null,null,null,null,null,null,null,null,null,null,null,null,null,null,null,null,null,null,null,null,null,null,null,null,null,null,null,null,null,null,null,null,null,null,"Tarih",null,null,null,null,null,null,null,"Teori  Ders",null,null,"Diğer Faaliyetler",null,null,null,null,null,null,null,null,null,null,null,null,null,null,null,"2.Hafta"]
["Çizelge 2. DERS YÜKÜ ÇİZELGESİ",null,null,null,null,null,null,null,null,null,null,null,null,null,null,null,null,null,null,null,null,null,null,null,null,null,null,null,null,null,null,null,null,null,null,null,null,null,null,null,null,null,null,null,null,"Y.Lisans",null,null,"Staj",null,"Mezuniyet",null,null,"Uygula",null,null,"Ara Sınav",null,null,null,null,null,"ücrete "]
["Fakültede/Yüksekokulda",null,null,null,null,null,null,null,null,null,null,null,null,"Haftalık Ders",null,null,null,null,null,"Diğer Fakülte ve Yüksekokullarda",null,null,null,null,null,null,null,null,null,null,"Haftalık Ders",null,null,null,null,null,null,null,null,null,null,null,null,null,null,"Doktora",null,null,null,null,"Çalışm.",null,null,null,null,null,null,null,null,"Zorunlu",null,null,"tabi"]
["Dersin Kodu Adı",null,null,null,null,null,null,null,null,null,null,null,null,"Teori",null,"Diğer",null,null,null,"Dersin Kodu ve Adı",null,null,null,null,null,null,null,null,null,null,"Teori",null,"Diğer",null,null,"Tüm Dersler",null,null,null,null,null,null,null,null,null,null,null,null,null,null,null,null,null,null,null,null,null,null,null,"Ders",null,null,"ders"]
[null,null,null,null,null,null,null,null,null,null,null,null,null,null,null,null,null,null,null,null,null,null,null,null,null,null,null,null,null,null,null,null,null,null,null,"Yapılamayan Dersler",null,null,null,null,null,null,null,null,null,null,null,null,null,null,null,null,null,null,null,null,null,null,null,"Yükü",null,null,"Yükü"]
[null,null,null,null,null,null,null,null,null,null,null,null,null,null,null,null,null,null,null,null,null,null,null,null,null,null,null,null,null,null,null,null,null,null,null,"Yapılan Dersler",null,null,null,null,null,null,null,null,null,null,null,null,null,null,null,null,null,null,null,null,0,"(10)*",null,{"$f":"SUM(AT29)-BH29","v":0},null,null,null,"(20)**"]
[null,null,null,null,null,null,null,null,null,null,null,null,null,null,null,null,null,null,null,null,null,null,null,null,null,null,null,null,null,null,null,null,null,null,null,"Haftalık Toplam"]
[]
[null,null,null,null,null,null,null,null,null,null,null,null,null,null,null,null,null,null,null,null,null,null,null,null,null,null,null,null,null,null,null,null,null,null,null,"Tarih",null,null,null,null,null,null,null,"Teori  Ders",null,null,"Diğer Faaliyetler",null,null,null,null,null,null,null,null,null,null,null,null,null,null,null,"3.Hafta"]
[null,null,null,null,null,null,null,null,null,null,null,null,null,null,null,null,null,null,null,null,null,null,null,null,null,null,null,null,null,null,null,null,null,null,null,null,null,null,null,null,null,null,null,null,null,"Y.Lisans",null,null,"Staj",null,"Mezuniyet",null,null,"Uygula",null,null,"Ara Sınav",null,null,null,null,null,"ücrete "]
[null,null,null,null,null,null,null,null,null,null,null,null,null,null,null,null,null,null,null,null,null,null,null,null,null,null,null,null,null,null,null,null,null,null,null,null,null,null,null,null,null,null,null,null,null,"Doktora",null,null,null,null,"Çalışm.",null,null,null,null,null,null,null,null,"Zorunlu",null,null,"tabi"]
[null,null,null,null,null,null,null,null,null,null,null,null,null,null,null,null,null,null,null,null,null,null,null,null,null,null,null,null,null,null,null,null,null,null,null,"Tüm Dersler",null,null,null,null,null,null,null,null,null,null,null,null,null,null,null,null,null,null,null,null,null,null,null,"Ders",null,null,"ders"]
[null,null,null,null,null,null,null,null,null,null,null,null,null,null,null,null,null,null,null,null,null,null,null,null,null,null,null,null,null,null,null,null,null,null,null,"Yapılamayan Dersler",null,null,null,null,null,null,null,null,null,null,null,null,null,null,null,null,null,null,null,null," ",null,null,"Yükü",null,null,"Yükü"]
[null,null,null,null,null,null,null,null,null,null,null,null,null,null,null,null,null,null,null,null,null,null,null,null,null,null,null,null,null,null,null,null,null,null,null,"Yapılan Dersler",null,null,null,null,null,null,null,null,null,null,null,null,null,null,null,null,null,null,null,null,null,"(10)*",null,{"$f":"SUM(AT37)-BH37","v":0},null,null,null,"(20)**"]
[null,null,null,null,null,null,null,null,null,null,null,null,null,null,null,null,null,null,null,null,null,null,null,null,null,null,null,null,null,null,null,null,null,null,null,"Haftalık Toplam"]
[]
[null,null,null,null,null,null,null,null,null,null,null,null,null,null,null,null,null,null,null,null,null,null,null,null,null,null,null,null,null,null,null,null,null,null,null,"Tarih",null,null,null,null,null,null,null,"Teori  Ders",null,null,"Diğer Faaliyetler",null,null,null,null,null,null,null,null,null,null,null,null,null,null,null,"4.Hafta"]
[null,null,null,null,null,null,null,null,null,null,null,null,null,null,null,null,null,null,null,null,null,null,null,null,null,null,null,null,null,null,null,null,null,null,null,null,null,null,null,null,null,null,null,null,null,"Y.Lisans",null,null,"Staj",null,"Mezuniyet",null,null,"Uygula",null,null,"Ara Sınav",null,null,null,null,null,"ücrete "]
[null,null,null,null,null,null,null,null,null,null,null,null,null,null,null,null,null,null,null,null,null,null,null,null,null,null,null,null,null,null,null,null,null,null,null,null,null,null,null,null,null,null,null,null,null,"Doktora",null,null,null,null,"Çalışm.",null,null,null,null,null,null,null,null,"Zorunlu",null,null,"tabi"]
[null,null,null,null,null,null,null,null,null,null,null,null,null,null,null,null,null,null,null,null,null,null,null,null,null,null,null,null,null,null,null,null,null,null,null,"Tüm Dersler",null,null,null,null,null,null,null,null,null,null,null,null,null,null,null,null,null,null,null,null,null,null,null,"Ders",null,null,"ders"]
["Yüksek Lisans Öğrenci Sayısı",null,null,null,null,null,null,null,null,null,null,"Ders",null,null,null,null,null,"Yüksek Lisans Öğrenci Sayısı",null,null,null,null,null,null,null,null,null,null,"Ders",null,null,null,null,null,null,"Yapılamayan Dersler",null,null,null,null,null,null,null,null,null,null,null,null,null,null,null,null,null,null,null,null,null,null,null,"Yükü",null,null,"Yükü"]
[null,null,null,null,null,null,null,null,null,null,null,"Tez",null,null,null,null,null,null,null,null,null,null,null,null,null,null,null,null,"Tez",null,null,null,null,null,null,"Yapılan Dersler",null,null,null,null,null,null,null,null,null,null,null,null,null,null,null,null,null,null,null,null,null,"(10)*",null,{"$f":"SUM(AT45)-BH45","v":0},null,null,null,"(20)**"]
["Doktora Öğrenci Sayısı",null,null,null,null,null,null,null,null,null,null,"Ders",null,null,null,null,null,"Doktora Öğrenci Sayısı",null,null,null,null,null,null,null,null,null,null,"Ders",null,null,null,null,null,null,"Haftalık Toplam"]
[null,null,null,null,null,null,null,null,null,null,null,"Tez",null,null,null,null,null,null,null,null,null,null,null,null,null,null,null,null,"Tez"]
["TOPLAM",null,null,null,null,null,null,null,null,null,null,null,null,{"$f":"SUM(N27:O46)","v":0},null,{"$f":"SUM(P27:Q46)","v":0},null,"TOPLAM",null,null,null,null,null,null,null,null,null,null,null,null,0,null,{"$f":"SUM(AG27:AH46)","v":0},null,null,"Tarih",null,null,null,null,null,null,null,"Teori  Ders",null,null,"Diğer Faaliyetler",null,null,null,null,null,null,null,null,null,null,null,null,null,null,null,"5.Hafta"]
[null,null,null,null,null,null,null,null,null,null,null,null,null,null,null,null,null,null,null,null,null,null,null,null,null,null,null,null,null,null,null,null,null,null,null,null,null,null,null,null,null,null,null,null,null,"Y.Lisans",null,null,"Staj",null,"Mezuniyet",null,null,"Uygula",null,null,"Ara Sınav",null,null,null,null,null,"ücrete "]
["Çizelge 3.  ARA SINAVLAR",null,null,null,null,null,null,null,null,null,null,null,null,null,null,null,null,null,null,null,null,null,null,null,null,null,null,null,null,null,null,null,null,null,null,null,null,null,null,null,null,null,null,null,null,"Doktora",null,null,null,null,"Çalışm.",null,null,null,null,null,null,null,null,"Zorunlu",null,null,"tabi"]
["Dersin Kodu ve Adı",null,null,null,null,null,null,null,null,null,null,null,null,null,null,null,null,null,null,"Sınav Tarihi",null,null,null,null,"Öğrenci Sayısı",null,null,null,null,"Ara Sınav Yükü*",null,null,null,null,null,"Tüm Dersler",null,null,null,null,null,null,null,null,null,null,null,null,null,null,null,null,null,null,null,null,null,null,null,"Ders",null,null,"ders"]
[null,null,null,null,null,null,null,null,null,null,null,null,null,null,null,null,null,null,null,null,null,null,null,null,null,null,null,null,null,null,null,null,null,null,null,"Yapılamayan Dersler",null,null,null,null,null,null,null,null,null,null,null,null,null,null,null,null,null,null,null,null,null,null,null,"Yükü",null,null,"Yükü"]
[null,null,null,null,null,null,null,null,null,null,null,null,null,null,null,null,null,null,null,null,null,null,null,null,null,null,null,null,null,null,null,null,null,null,null,"Yapılan Dersler",null,null,null,null,null,null,null,null,null,null,null,null,null,null,null,null,null,null,null,null,null,"(10)*",null,{"$f":"SUM(AT53)-BH53","v":0},null,null,null,"(20)**"]
[null,null,null,null,null,null,null,null,null,null,null,null,null,null,null,null,null,null,null,null,null,null,null,null,null,null,null,null,null,null,null,null,null,null,null,"Haftalık Toplam"]
[]
[null,null,null,null,null,null,null,null,null,null,null,null,null,null,null,null,null,null,null,null,null,null,null,null,null,null,null,null,null,null,null,null,null,null,null,"AYLIK ÜCRETE TABİ DERS YÜKÜ (SAAT)"]
[]
[]
[null,null,null,null,null,null,null,null,null,null,null,null,null,null,null,null,null,null,null,null,null,null,null,null,null,null,null,null,null,null,null,null,null,null,null,"İlgili öğretim elemanınca …….. ayında toplam*** ",null,null,null,null,null,null,null,null,null,null,null,null,null,null,"………… ()",null,null,null,null,null,null,null,"saat ekders okutulmuş "]
[null,null,null,null,null,null,null,null,null,null,null,null,null,null,null,null,null,null,null,null,null,null,null,null,null,null,null,null,null,null,null,null,null,null,null,"olup,",null,null,"bunun ***",null,null,null,"…………()",null,null,null,null,"saatinden ücret talep etmektedir."]
[null,null,null,null,null,null,null,null,null,null,null,null,null,null,null,null,null,null,null,"T O P L A M"]
["* Öğrenci Sayısına Göre : 1-50: 1, 51-100: 2, 101-150: 3, ……….",null,null,null,null,null,null,null,null,null,null,null,null,null,null,null,null,null,null,null,null,null,null,null,null,null,null,null,null,null,null,null,null,null,null,"* Diğer Faaliyetler toplamı 10'u geçmez, geçerse yalnız 10 saati esas alınır."]
["Çizelge 4. YAPILAMAYAN DERSLER",null,null,null,null,null,null,null,null,null,null,null,null,null,null,null,null,null,null,null,null,null,null,null,null,null,null,null,null,null,null,null,null,null,null,"** Ücrete Tabi haftalık yük toplamı 20'yi geçmez geçerse 20 saati esas alınır."]
["Yapılamayan Günler",null,null,null,null,null,null,null,null,null,null,null,null,null,null,null,null,null," Ders Saati",null,null,null,null,null,null,null,null,null,null,null,null,null,null,null,null,"*** Yazıyla doldurulacaktır."]
[null,null,null,null,null,null,null,null,null,null,null,null,null,null,null,null," Teorik",null,null,null," Diğer"]
[null,null,null,null,null,null,null,null,null,null,null,null,null,null,null,null,null,null,null,null,null,null,null,null,null,null,null,null,null,null,null,null,null,null,null,"  Bildiri sahibinin adı soyadı imzası",null,null,null,null,null,null,null,null,null,null,null,"Bölüm Başkanı",null,null,null,null,null,null,null,null,null,"Onay "]
[]
[]
[]
[null,null,null,null,null,null,null,null,null,null,null,null,null,null,null,null,null,null,null,null,null,null,null,null,null,null,null,null,null,null,null,null,null,null,null,null,".....................................",null,null,null,null,null,null,null,null,null,"Prof.Dr.Arif ÖZBEK",null,null,null,null,null,null,null,null,null,"Prof.Dr.Abdulkadir YAŞAR"]
[null,null,null,null,null,null,null,null,null,null,null,null,null,null,null,null,null,null,null,null,null,null,null,null,null,null,null,null,null,null,null,null,null,null,null,null,null,null,null,null,null,null,null,null,null,null,null,null,null,null,null,null,null,null,null,null,"Dekan "]
[]
[null,null,null,"TOPLAM"]
[]
[]
[]
[]
[null,null,null,"HAZIRLAYAN",null,null,null,null,null,null,null,"KONTROL EDEN",null,null,null,null,null,null,"ONAYLAYAN"]